program: Gaussian 09
title: 000287958
version: EM64L-G09RevD.01
frameworkgroup: C1[X(C9H15ClO2)]
method: RPBEPBE
basis: SDD
operation: Freq
keyword: #p
keyword: freq=noraman
keyword: PBEPBE/SDD
title: #p freq=noraman PBEPBE/SDD
converged: NO YES NO NO
title: Mulliken charges:
elementType: Cl O O C C C C C C C C C H H H H H H H H H H H H H H H
charge: -0.065295 -0.247642 -0.279024 -0.421251 -0.403658 -0.028994 -0.386776 -0.299521 -0.384458 0.576646 -0.777410 -0.612870 0.221260 0.203350 0.218054 0.216739 0.217032 0.205988 0.202894 0.216244 0.211286 0.216806 0.209844 0.242477 0.247824 0.227898 0.272557
chargesum: 0.00000
title: Mulliken charges with hydrogens summed into heavy atoms:
elementType: Cl O O C C C C C C C C C
charge: -0.065295 -0.247642 -0.279024 0.003358 0.031134 0.188038 0.022107 0.128009 0.042193 0.576646 -0.059212 -0.340312
polarizability: 1.27613562e+02 1.41953425e+01 1.08915251e+02 3.72195643e-01 -1.79482932e+00 9.39075964e+01
1716.lowfreq: -17.7119 -1.6334 -0.0021 -0.0013 0.0008 13.2206 23.8880 35.3875 55.7247
frequency: 18.8463 35.0800 55.5046 125.5608 133.8323 148.5335 182.1393 215.4124 260.0667 274.7660 301.8804 335.0322 377.9916 412.6935 438.0039 500.6333 526.8371 565.1277 651.1400 733.4392 764.8755 773.8122 797.9551 841.2187 850.4056 852.8771 879.4467 925.5080 945.0289 958.5484 1006.5345 1020.9246 1040.0046 1053.6881 1054.6408 1108.0765 1119.6385 1171.8325 1183.7394 1187.3841 1234.3884 1254.4655 1269.4056 1302.0576 1307.2256 1329.2098 1342.5744 1347.3518 1352.8845 1360.5390 1365.3963 1392.9781 1446.4512 1447.9450 1455.5919 1460.7392 1464.5463 1469.8033 1472.7765 1666.5506 2976.1515 2980.1588 2984.5496 2990.0488 2990.8041 2997.2246 3008.7719 3044.8186 3051.0078 3054.8912 3058.3733 3072.7640 3084.5421 3108.3983 3193.5618
redmass: 3.7474 7.2796 3.3175 3.3177 3.3815 1.0876 3.6617 3.8514 4.2493 2.8693 2.2934 2.3008 2.3189 3.8115 2.9545 2.3059 3.4724 3.6892 2.9082 5.7084 3.7581 1.9472 1.5622 2.7546 2.2934 2.8727 2.6859 1.5091 5.5437 1.6373 2.4843 2.6116 1.5399 1.9023 1.6604 2.0355 2.0991 1.2821 1.4883 1.7209 1.1729 1.2344 1.2157 1.5422 1.3393 1.2250 1.4144 1.4855 1.3252 1.3213 1.2602 1.2566 1.0895 1.0875 1.0876 1.0843 1.0636 1.0558 1.0888 6.7361 1.0402 1.0558 1.0598 1.0677 1.0743 1.0610 1.0713 1.0999 1.1069 1.0954 1.1010 1.1024 1.1023 1.0987 1.0960
irintensity: 0.1190 0.1435 0.2223 5.0094 0.7230 0.3981 5.1930 1.6626 4.7921 5.7233 0.5417 5.6635 0.4745 10.7452 8.3842 5.7215 2.3166 21.7578 1.7419 64.5777 19.8364 7.9178 60.4579 14.6571 13.1356 11.1657 49.2016 4.2334 175.8288 34.2777 24.1535 49.5754 21.4100 31.3935 14.1904 33.8647 8.3602 1.2544 21.2376 3.8510 6.5613 8.7851 11.0986 41.3711 9.7157 1.6342 1.2990 5.3030 0.7169 2.7520 3.8941 25.3721 6.2957 9.8639 13.7100 11.0580 6.9354 13.0669 12.1429 32.0706 16.6330 45.2479 34.8594 45.8823 15.0133 39.8539 68.3384 27.8851 20.0222 18.4319 51.6982 38.1499 41.3249 8.9544 5.9161
temp: 298.150 k
press: 1.00000 atm
elementType: 17 8 8 6 6 6 6 6 6 6 6 6 1 1 1 1 1 1 1 1 1 1 1 1 1 1 1
symmnumber: 1
zpe: 593154.0 jmol-1
zpe.correction: 0.225920 hartree
zpe.thermalcorrener: 0.239021 hartree
zpe.thermalcorrenthalpy: 0.239965 hartree
zpe.thermalcorrgfe: 0.184416 hartree
zpe.sumelectzpe: -961.463584 hartree
zpe.sumelectthermal: -961.450483 hartree
zpe.sumelectthermalent: -961.449539 hartree
zpe.sumelectthermalfe: -961.505088 hartree
dipole: -1.9584 -0.9833 0.3463
dipole: 2.2186
quadrupole: -82.9377 -77.2876 -78.8297
quadrupole: -4.1546 -0.5134 2.9990
quadrupole: -3.2527 2.3974 0.8553 -4.1546 -0.5134 2.9990
hfenergy: -961.6895041 hartree
pointgroup: C01 [X(C9H15Cl1O2)]
dipole: 0.5824842 -0.4753637 -0.4434308 debye
polarizability: 115.9005176|-14.8892618|112.3036468|-7.8471243|12.5123781|102.2322449 unknown
InChI: InChI=1S/C9H15ClO2/c1-8(6-10)7-12-9-4-2-3-5-11-9/h6,9H,2-5,7H2,1H3
charge 0 multiplicity 1
27 atoms
Cl -3.097158 2.311947 1.416049
O  1.302785 -0.186688 1.362086
O  0.154167 -1.015918 -0.618573
C  2.55906 -1.095521 -0.599358
C  2.806078 0.344513 -1.104853
C  1.30339 -1.170906 0.282908
C  2.837119 1.325835 0.091232
C  1.534093 1.20676 0.899764
C  -1.165898 -1.162877 0.046882
C  -1.920194 0.16006 0.042377
C  -2.285258 0.71625 -1.313139
C  -2.195546 0.733952 1.236319
H  2.441419 -1.802328 -1.439737
H  3.419272 -1.430307 0.011488
H  1.992765 0.632249 -1.797888
H  3.754879 0.388866 -1.670587
H  1.226791 -2.13474 0.824751
H  3.699078 1.091878 0.746331
H  2.955063 2.369995 -0.257509
H  1.563156 1.796993 1.830268
H  0.66558 1.53123 0.292909
H  -1.034355 -1.544318 1.076939
H  -1.719188 -1.910288 -0.554591
H  -2.703176 1.733298 -1.246915
H  -1.386577 0.733288 -1.9573
H  -3.029844 0.066616 -1.813589
H  -1.891502 0.338363 2.207535
