program: Gaussian 09
title: 000287951
version: EM64L-G09RevD.01
frameworkgroup: C1[X(C9H14O2)]
method: RPBEPBE
basis: SDD
operation: Freq
keyword: #pfreq=noraman
keyword: PBEPBE/SDD
title: #p freq=noraman PBEPBE/SDD
converged: NO YES NO NO
title: Mulliken charges:
elementType: O O C C C C C C C C C H H H H H H H H H H H H H H
charge: -0.286775 -0.287967 -0.099849 -0.078383 -0.416736 -0.442018 -0.380077 -0.397159 -0.038235 -0.095545 -0.538522 0.240821 0.232213 0.221992 0.216895 0.200565 0.225139 0.206035 0.190358 0.205413 0.215203 0.220792 0.231663 0.216664 0.237513
chargesum: 0.00000
title: Mulliken charges with hydrogens summed into heavy atoms:
elementType: O O C C C C C C C C C
charge: -0.286775 -0.287967 0.140972 0.153830 0.022151 -0.016314 0.016316 0.023456 0.182557 0.136118 -0.084345
polarizability: 1.16825011e+02 -5.67980518e+00 9.66340063e+01 -1.67714305e-01 1.80451160e+00 7.59467058e+01
1716.lowfreq: -18.9360 -3.2362 -0.0010 -0.0007 -0.0006 4.5523 40.2902 102.5702 116.1578
frequency: 39.9185 102.5225 116.1488 148.6593 214.4135 289.1366 298.6818 339.1461 377.8525 421.3037 465.5925 532.9823 580.5172 633.3057 681.7562 723.0291 767.5329 781.7029 843.6943 851.6108 860.4119 890.8717 912.3496 928.9931 946.6186 961.6878 986.0069 1001.3289 1005.1574 1056.4325 1065.2210 1103.8054 1107.7793 1120.6148 1151.1348 1184.9679 1237.5959 1241.8331 1244.2171 1270.0928 1276.6736 1300.1859 1314.5929 1320.6784 1329.5922 1335.1735 1347.6441 1354.8061 1368.1430 1406.9875 1452.4120 1460.8086 1469.5229 1474.7231 1656.6734 2967.2084 2971.6435 2986.2513 2988.5226 2992.5715 2997.3832 3038.0365 3039.5381 3044.1473 3055.9717 3066.3796 3097.6236 3126.4081 3211.5892
redmass: 4.1576 2.7658 2.7743 2.6950 2.6753 2.4712 3.3379 1.9031 3.1611 2.8940 2.5271 2.7644 2.3788 3.0977 2.9737 4.4446 2.2154 2.6998 2.8723 3.1336 2.2214 2.8768 2.1413 2.5659 2.3084 1.3947 2.4371 1.6718 1.3999 1.7755 1.5396 1.9386 1.2628 2.2031 2.0206 1.3212 1.2291 1.2925 1.3407 1.2549 1.2686 1.2593 1.3067 1.3551 1.7538 1.4018 1.5101 1.4595 1.4455 1.1939 1.0829 1.0910 1.0840 1.0911 5.0989 1.0647 1.0754 1.0854 1.0679 1.0668 1.0617 1.0931 1.0924 1.0974 1.1026 1.1012 1.0585 1.0944 1.1153
irintensity: 3.2973 1.4510 0.1231 0.9474 1.6913 0.4640 0.9072 1.2667 9.8693 7.1947 1.2532 0.2783 4.7534 6.6939 0.9292 11.1628 1.8076 3.6572 24.3031 20.1766 5.0991 14.2058 27.3231 10.7104 33.5788 55.4281 23.8726 132.1547 47.3394 0.5296 2.7053 24.2655 2.5534 43.9351 3.1933 2.8460 6.0465 0.1213 1.9167 1.9834 0.4317 24.1629 1.1147 8.0001 2.3649 1.0277 1.7063 3.1065 2.2149 24.2528 10.2829 9.2545 15.0188 10.6753 1.9884 41.1066 9.6084 42.5097 69.7383 29.4268 22.3696 61.4091 11.6021 31.1416 24.4463 82.8986 7.4684 10.1192 17.0684
temp: 298.150 k
press: 1.00000 atm
elementType: 8 8 6 6 6 6 6 6 6 6 6 1 1 1 1 1 1 1 1 1 1 1 1 1 1
symmnumber: 1
zpe: 561877.1 jmol-1
zpe.correction: 0.214008 hartree
zpe.thermalcorrener: 0.224222 hartree
zpe.thermalcorrenthalpy: 0.225166 hartree
zpe.thermalcorrgfe: 0.178067 hartree
zpe.sumelectzpe: -500.895209 hartree
zpe.sumelectthermal: -500.884995 hartree
zpe.sumelectthermalent: -500.884051 hartree
zpe.sumelectthermalfe: -500.931149 hartree
dipole: 1.4186 0.6448 0.7587
dipole: 1.7332
quadrupole: -61.9769 -68.4627 -66.1068
quadrupole: -0.6248 0.5880 2.6894
quadrupole: 3.5385 -2.9472 -0.5913 -0.6248 0.5880 2.6894
hfenergy: -501.1092166 hartree
pointgroup: C01 [X(C9H14O2)]
dipole: -0.5719213 -0.2714286 0.2533726 debye
dipolederiv: -1.07482 0.1335846 0.082809 0.0210445 -0.5465006 -0.0595923 0.1960638 -0.038317 -0.4284493 -0.9095956 -0.1332932 0.1586816 -0.1988943 -0.5595301 0.0200008 0.2072533 0.0389629 -0.4609249 0.7027976 -0.1039961 -0.0248218 0.1397376 0.1430318 -0.0644905 0.0472436 0.0355019 0.318971 0.4702508 0.0933466 -0.0823064 -0.0195575 0.2167322 -0.0474218 -0.2657542 -0.115076 0.3794811 -0.1021791 0.0033849 -0.0586549 -0.035169 0.0634946 0.0689037 -0.0847797 0.0061798 0.0255775 0.0431675 0.0009886 -0.0302823 -0.0497593 0.0432916 0.0153415 -0.034916 -0.0348036 0.1223123 0.0823595 -0.0011545 -0.0138835 0.0503535 0.0291932 -0.0198981 -0.0800811 -0.0118852 0.1565484 0.070424 0.0135318 -0.0332268 0.0036647 0.0380272 -0.0078092 0.0046168 -0.0019867 0.0874675 1.1072129 -0.1177186 -0.1380309 0.0036065 0.6043211 -0.0689162 -0.1900135 -0.0333472 0.5622534 -0.0390547 0.0178307 0.087404 0.0393481 0.0481988 0.0931421 0.0708708 0.0691014 -0.1998427 -0.0973919 0.0512335 0.1729793 0.0569008 -0.0712617 0.0581496 0.1564085 0.0688756 -0.2804047 -0.0088844 0.0285753 0.0367297 0.0319571 0.0701851 -0.0212542 0.0483703 -0.0254707 -0.1324279 -0.0885067 0.0595222 -0.0994424 0.0407774 -0.0049909 0.0551033 -0.0243365 0.0693159 -0.1252715 0.0092696 -0.0333503 0.0759532 -0.0072658 0.0858735 -0.014191 0.0688801 0.0284194 -0.1051712 0.0378012 0.0355912 -0.0062855 0.0514133 -0.1709455 -0.0542271 0.0063143 -0.0806955 0.058467 -0.0201119 -0.0463299 0.0706518 -0.0141885 0.0843342 0.0155123 0.0599579 0.0715278 -0.1319595 0.0271732 0.0874387 0.0080654 0.054689 -0.1276866 -0.0374551 -0.0184053 -0.0832493 0.0639975 -0.1201074 0.0824591 -0.097378 0.0772154 -0.0001819 0.0535635 -0.1456174 0.0665686 -0.0019729 0.0315253 -0.0185022 0.0703579 -0.0426544 0.0319002 0.0152778 0.1467351 -0.0109269 -0.1535911 -0.1371771 -0.1315097 -0.0499222 -0.1304494 -0.0545343 -0.0242148 -0.0296585 -0.0124904 0.0767735 0.062235 0.0295763 0.0976493 0.0268345 0.045716 0.0422261 0.0533832 0.0107156 -0.1236496 -0.0500187 0.0401159 -0.0194624 -0.008058 -0.027748 0.092274 0.0702456 0.0816566 -0.1306718 0.003922 -0.0545028 -0.0457291 -0.0760327 -0.0260295 -0.0545098 -0.0850953 -0.0505605 0.135832 -0.0955147 0.0444403 -0.0927236 0.0481811 0.0841571 -0.0086073 -0.117941 0.0050737 0.1461621 0.095224 -0.0812625 -0.0691313 -0.0636947 0.0009523 -0.0469073 -0.0597448 -0.0530903 0.1404936 unknown
polarizability: 116.5531406|-6.1160772|97.0440626|0.7581206|0.2520098|75.8085202 unknown
InChI: InChI=1S/C9H14O2/c1-2-9-10-7-5-3-4-6-8(7)11-9/h2,7-9H,1,3-6H2
charge 0 multiplicity 1
25 atoms
O  0.815621 1.501919 0.461635
O  0.640262 -0.564146 -0.717301
C  -0.509203 0.879977 0.743334
C  -0.228375 -0.621677 0.498392
C  -1.599967 1.466044 -0.175697
C  -1.447652 -1.508721 0.221235
C  -2.858282 0.565416 -0.214536
C  -2.485033 -0.849172 -0.715927
C  1.493078 0.615765 -0.537765
C  2.8771 0.302964 -0.01209
C  3.4258 -0.93503 -0.016319
H  -0.719776 1.08624 1.807522
H  0.37471 -1.027493 1.336668
H  -1.187951 1.548998 -1.199474
H  -1.84656 2.490154 0.159164
H  -1.924436 -1.732514 1.197234
H  -1.095396 -2.472788 -0.19071
H  -3.621766 1.020395 -0.873346
H  -3.309573 0.495295 0.797553
H  -3.384287 -1.490969 -0.779001
H  -2.062535 -0.774103 -1.736346
H  1.522428 1.131326 -1.518266
H  3.42532 1.173782 0.371885
H  4.434904 -1.114183 0.370369
H  2.865867 -1.792181 -0.406911
