program: Gaussian 09
title: 000287947
version: EM64L-G09RevD.01
frameworkgroup: C1[X(C5H7ClO)]
method: RPBEPBE
basis: SDD
operation: Freq
keyword: #p
keyword: freq=noraman
keyword: PBEPBE/SDD
title: #p freq=noraman PBEPBE/SDD
converged: NO NO NO NO
title: Mulliken charges:
elementType: Cl O C C C C C H H H H H H H
charge: -0.073477 -0.247996 -0.410537 -0.309756 -0.329042 -0.024220 -0.199253 0.248705 0.230867 0.229340 0.196897 0.206713 0.237061 0.244698
chargesum: 0.00000
title: Mulliken charges with hydrogens summed into heavy atoms:
elementType: Cl O C C C C C
charge: -0.073477 -0.247996 0.069035 0.116481 0.114732 -0.024220 0.045445
polarizability: 7.98862843e+01 -6.30514381e+00 6.75203777e+01 -1.16367718e+00 1.34664989e+00 4.06574239e+01
1716.lowfreq: -18.0532 -5.4233 0.0025 0.0029 0.0033 11.7814 113.8517 227.5718 262.3481
frequency: 113.8343 227.5695 262.3435 295.0230 344.2220 410.4007 510.6622 572.7200 754.7639 793.3411 807.5789 914.1314 946.6866 958.8805 1003.1500 1028.0104 1066.5249 1095.4539 1181.4503 1199.9052 1248.6019 1277.8848 1323.7709 1326.6296 1369.2945 1446.5923 1453.4661 1464.9409 1686.3518 2918.2169 2954.5133 2995.0098 3045.3137 3049.7356 3089.7144 3151.9146
redmass: 3.4627 2.3379 5.5326 2.3933 7.3125 2.3190 3.9040 6.3304 2.5912 1.9299 1.5875 2.5921 3.6315 2.5522 1.9703 2.3655 2.0239 3.5961 1.0759 1.2131 1.2560 1.3636 1.4112 1.3808 1.3025 1.0932 1.0812 1.0877 7.2985 1.0696 1.0689 1.0595 1.0911 1.1006 1.0971 1.0932
irintensity: 4.2795 1.0807 2.2251 11.8114 4.6185 6.0422 10.9822 38.9209 6.0411 13.0266 26.4437 1.2398 5.7497 30.0123 4.4615 29.7087 12.4702 49.0656 2.0706 20.6021 3.7450 6.8095 20.7611 30.0046 1.3222 11.7665 4.9795 6.4930 32.7065 71.4793 70.3825 17.0443 24.6145 16.1903 29.4622 2.6392
temp: 298.150 k
press: 1.00000 atm
elementType: 17 8 6 6 6 6 6 1 1 1 1 1 1 1
symmnumber: 1
zpe: 288830.0 jmol-1
zpe.correction: 0.110010 hartree
zpe.thermalcorrener: 0.116646 hartree
zpe.thermalcorrenthalpy: 0.117590 hartree
zpe.thermalcorrgfe: 0.078893 hartree
zpe.sumelectzpe: -729.431426 hartree
zpe.sumelectthermal: -729.424790 hartree
zpe.sumelectthermalent: -729.423846 hartree
zpe.sumelectthermalfe: -729.462543 hartree
dipole: -0.8611 -0.0938 1.1041
dipole: 1.4034
quadrupole: -56.9554 -41.2846 -49.4066
quadrupole: -0.6959 -2.5134 -0.0335
quadrupole: -7.7399 7.9310 -0.1911 -0.6959 -2.5134 -0.0335
hfenergy: -729.5414357 hartree
pointgroup: C01 [X(C5H7Cl1O1)]
dipole: -0.3321054 0.0384777 -0.439398 debye
dipolederiv: -0.9094532 -0.0258084 -0.0432217 0.028424 -0.1930654 -0.0078368 -0.0011346 -0.006967 -0.0838941 -0.529041 -0.0329074 -0.0295024 0.005329 -0.7577815 0.0240784 -0.0015532 0.0528392 -0.3948317 -0.340041 0.0051991 -0.0314894 0.0401355 -0.0665128 -0.0019899 -0.0975555 -0.0360081 0.1612458 0.4261657 0.1118691 -0.0110151 0.1298545 0.4603149 -0.0844751 0.0918336 -0.1432802 0.4085499 0.3762506 -0.1169082 0.0575395 -0.1768799 0.5094733 0.0628686 0.0141852 0.09231 0.3949319 1.1674305 0.0283765 0.0391035 0.0032264 0.3601524 0.0422649 -0.0063774 0.0838757 -0.1388251 -0.2881381 0.0121834 -0.0111425 -0.0694398 -0.1872452 0.0052544 0.0046773 -0.0245069 -0.2273374 0.0687069 0.0395873 -0.0204832 -0.0009932 0.0254731 -0.0512393 -0.029406 -0.0917902 -0.0785979 0.0486729 -0.0729522 0.0576151 -0.0595009 -0.0231723 0.0651587 0.0569227 0.1063726 0.0367705 -0.0266171 0.1028121 0.0205187 0.0883823 -0.0895963 -0.0145584 0.0315607 -0.0474033 0.0820915 0.022227 -0.0510486 0.0067958 -0.0434441 0.0212518 -0.0473648 -0.0442395 0.067848 -0.2211301 -0.060011 -0.0303245 -0.0757012 0.014588 0.0048224 -0.0481709 -0.1003391 -0.1495289 -0.1390397 0.0085585 -0.0493902 0.0283976 -0.0260663 -0.0506606 0.0786202 0.0673706 0.1147338 0.0172648 0.0352892 0.0793121 0.0125854 0.0663847 -0.0134538 -0.0226101 0.0140552 -0.0184948 0.1828016 unknown
polarizability: 79.7344409|6.365865|67.5936004|1.840979|1.7266662|40.7360447 unknown
InChI: InChI=1S/C5H7ClO/c6-5-1-3-7-4-2-5/h1H,2-4H2
charge 0 multiplicity 1
14 atoms
Cl 2.781433 -0.00022 0.043953
O  -1.850705 0.017527 0.3238
C  0.270461 1.310526 0.127037
C  -1.203982 1.17001 -0.320916
C  -1.235473 -1.247684 -0.090489
C  0.944303 -0.034988 0.011769
C  0.284467 -1.206976 -0.112063
H  0.331489 1.675676 1.169754
H  0.7825 2.054642 -0.512761
H  -1.797897 2.04636 -0.015633
H  -1.252212 1.06349 -1.426578
H  -1.61529 -1.546906 -1.094822
H  -1.59059 -1.994516 0.642157
H  0.815795 -2.158343 -0.226109
