program: Gaussian 09
title: 000287946
version: EM64L-G09RevD.01
frameworkgroup: C1[X(C6H10ClN)]
method: RPBEPBE
basis: SDD
operation: Freq
keyword: #p
keyword: freq=noraman
keyword: PBEPBE/SDD
title: #p freq=noraman PBEPBE/SDD
converged: YES YES NO NO
title: Mulliken charges:
elementType: Cl N C C C C C C H H H H H H H H H H
charge: -0.087270 -0.089859 -0.380376 -0.416495 -0.364310 -0.044869 -0.191619 -0.614689 0.195765 0.219332 0.224798 0.243947 0.232465 0.190049 0.240555 0.228449 0.189925 0.224202
chargesum: 0.00000
title: Mulliken charges with hydrogens summed into heavy atoms:
elementType: Cl N C C C C C C
charge: -0.087270 -0.089859 0.034721 0.052250 0.058204 -0.044869 0.048936 0.027887
polarizability: 1.03778469e+02 6.31541187e+00 7.83269643e+01 1.28622378e+00 1.41254508e+00 5.24539926e+01
1716.lowfreq: -19.6502 -7.2443 -1.7645 -0.0022 -0.0010 0.0015 87.9094 178.2120 223.4556
frequency: 87.8680 178.2048 223.4540 241.9840 251.6020 311.8487 324.0932 366.6754 410.1757 514.4765 565.8182 723.6467 775.6945 811.7746 931.6682 953.5686 957.2538 993.7251 1041.5020 1055.3240 1076.2477 1114.5225 1146.4963 1182.7752 1193.6043 1243.8612 1283.2569 1290.7296 1329.1433 1342.9312 1371.9950 1433.7521 1447.8107 1458.2218 1465.4998 1479.7472 1482.9526 1693.0588 2800.5490 2844.7114 2860.4111 2990.3891 2994.5530 3019.4886 3038.2816 3050.9330 3078.7259 3158.6937
redmass: 3.7759 1.9682 1.9715 2.9861 1.5692 2.1210 8.9673 2.4495 2.3568 3.7349 5.6616 4.5455 1.7996 1.2667 2.3188 3.3641 2.1809 2.0457 1.9018 2.1074 1.5665 1.3183 2.1515 1.1935 1.4175 1.7711 1.6884 1.3879 1.6029 1.6152 1.4361 1.1673 1.0937 1.0715 1.0589 1.0930 1.0639 7.4481 1.0715 1.0673 1.0608 1.0842 1.0599 1.0725 1.0883 1.1014 1.1009 1.0931
irintensity: 0.4191 2.6072 0.5395 1.3759 0.6349 12.8371 5.3804 1.4895 5.3562 4.4276 16.3633 19.4353 5.3389 26.9104 2.7284 67.1680 10.2807 18.5629 1.6618 13.8051 23.1951 7.7836 18.3742 3.5831 2.6290 9.9616 15.9769 1.8465 24.3792 27.5870 3.4030 2.9910 11.5953 11.3465 13.4184 11.5219 10.5986 20.2165 89.3083 55.7416 213.8787 33.4274 19.3809 47.4964 33.0609 24.0107 31.4272 4.5060
temp: 298.150 k
press: 1.00000 atm
elementType: 17 7 6 6 6 6 6 6 1 1 1 1 1 1 1 1 1 1
symmnumber: 1
zpe: 392337.5 jmol-1
zpe.correction: 0.149433 hartree
zpe.thermalcorrener: 0.157667 hartree
zpe.thermalcorrenthalpy: 0.158611 hartree
zpe.thermalcorrgfe: 0.116502 hartree
zpe.sumelectzpe: -748.779204 hartree
zpe.sumelectthermal: -748.770971 hartree
zpe.sumelectthermalent: -748.770026 hartree
zpe.sumelectthermalfe: -748.812136 hartree
dipole: 2.8395 -0.1111 0.8711
dipole: 2.9722
quadrupole: -58.2319 -50.4868 -58.1697
quadrupole: 0.4984 0.7127 0.0294
quadrupole: -2.6025 5.1427 -2.5402 0.4984 0.7127 0.0294
hfenergy: -748.9286375 hartree
pointgroup: C01 [X(C6H10Cl1N1)]
dipole: 1.110322 -0.0360992 0.3650086 debye
dipolederiv: -0.9371145 -0.0314648 -0.0656393 0.0296505 -0.2014706 -0.0067238 -0.0245022 -0.0098825 -0.0967562 -0.6716407 -0.0312554 -0.0364212 -0.0290771 -0.5035321 0.0007699 0.0519397 -0.0090256 -0.5544922 0.2292011 0.0863999 -0.0723536 0.2147905 0.31273 -0.0968802 0.00797 -0.0967604 0.4701533 -0.2562163 0.0259075 -0.0318487 0.005669 -0.0084253 -0.0137481 -0.0774682 -0.0552504 0.1797682 0.1595837 -0.0903588 0.0231496 -0.2737757 0.3877103 0.0976698 -0.021907 0.078851 0.4496058 1.2152979 0.0238593 0.0753617 -0.0191242 0.3527253 0.0376794 0.0184488 0.087824 -0.1322762 -0.1787595 0.0061037 0.0014137 0.0058492 -0.1398547 0.0119353 0.0428545 -0.0148077 -0.207683 0.5534946 0.0157542 0.0928285 0.0234895 0.1008545 0.0212876 0.0891708 0.0304072 0.361985 -0.010549 -0.0413924 -0.0122676 -0.0618745 0.0072522 -0.0515726 0.0125744 0.1111587 -0.2903533 -0.0341885 0.1388284 0.0255595 0.0925462 -0.0969175 -0.0201974 0.033403 -0.0437656 0.058084 0.015272 -0.0675384 0.0556391 -0.0743944 -0.0334962 0.0639855 0.0678374 0.1132097 0.0337326 0.0706071 0.0442593 -0.0129877 0.0021133 0.0184811 -0.0498357 -0.0304145 -0.0916108 -0.0849611 -0.0082075 -0.0893849 0.0382165 -0.0203786 -0.0785049 0.0836855 0.0671844 0.1158977 0.0016108 -0.0885428 -0.0634869 -0.1062886 0.0482732 -0.0207934 -0.0481539 -0.0628166 -0.190753 -0.2036383 0.0126295 0.0706146 0.0058606 0.0770854 -0.0184678 -0.0185553 0.0067365 -0.0156733 0.1761479 0.0096878 0.052303 0.0183789 0.1583542 -0.0827159 -0.0936659 0.0177618 -0.0789438 0.0593925 -0.1033197 0.00133 -0.0243127 -0.0274151 0.0636675 -0.0307917 -0.2398206 -0.0306895 -0.2436387 0.0227651 -0.0504783 0.0257114 -0.1517814 -0.0592428 0.1131116 0.0410479 0.0998143 0.0233187 unknown
polarizability: 103.5775518|6.514649|78.4229373|2.372754|1.8061137|52.558937 unknown
InChI: InChI=1S/C6H10ClN/c1-8-4-2-6(7)3-5-8/h2H,3-5H2,1H3
charge 0 multiplicity 1
18 atoms
Cl -3.199541 -0.012817 -0.105532
N  1.427076 -0.014596 -0.252804
C  0.777498 -1.187023 0.373914
C  -0.684966 -1.317951 -0.113487
C  0.801198 1.262417 0.151142
C  -1.359292 0.026272 -0.018965
C  -0.715013 1.204222 0.121153
C  2.890555 0.005765 -0.084343
H  0.786108 -1.121296 1.492853
H  1.343267 -2.093539 0.091623
H  -1.223939 -2.06052 0.504839
H  -0.709032 -1.677383 -1.159639
H  1.148712 2.057245 -0.538959
H  1.121505 1.57882 1.182271
H  -1.262083 2.148404 0.210133
H  3.326603 -0.92086 -0.497596
H  3.216337 0.097153 0.983553
H  3.316106 0.859891 -0.641753
