program: Gaussian 09
title: 000287941
version: EM64L-G09RevD.01
frameworkgroup: C1[X(C9H14O2)]
method: RPBEPBE
basis: SDD
operation: Freq
keyword: #pfreq=noraman
keyword: PBEPBE/SDD
title: #p freq=noraman PBEPBE/SDD
converged: YES YES NO YES
title: Mulliken charges:
elementType: O O C C C C C C C C C H H H H H H H H H H H H H H
charge: -0.295563 -0.265253 -0.043391 -0.038124 -0.464182 -0.459430 -0.395063 -0.395651 0.354333 -0.277026 -0.792703 0.236311 0.231169 0.223038 0.210410 0.223568 0.210410 0.198414 0.208748 0.198906 0.209219 0.233551 0.222130 0.233386 0.232794
chargesum: 0.00000
title: Mulliken charges with hydrogens summed into heavy atoms:
elementType: O O C C C C C C C C C
charge: -0.295563 -0.265253 0.192920 0.193045 -0.030734 -0.025453 0.012098 0.012475 0.354333 -0.043475 -0.104392
polarizability: 1.21950874e+02 2.10195043e+00 1.00110491e+02 -1.27405728e-01 -1.18854762e+00 7.29361827e+01
1716.lowfreq: -31.3304 -11.4908 -0.0008 -0.0006 -0.0006 7.3014 78.6233 123.1180 170.6859
frequency: 78.3901 123.1108 170.6842 177.1324 226.3742 279.8752 311.1077 356.4059 369.1528 383.7267 423.9330 445.7049 517.8719 529.0616 547.5953 674.2837 771.3975 780.4202 838.2153 840.5869 849.9582 880.5936 903.1148 955.3317 977.1239 987.1981 1020.2754 1048.5121 1050.3039 1068.1456 1101.7230 1105.2115 1137.4937 1158.9504 1206.8710 1211.0592 1235.8092 1237.4889 1285.2078 1294.0180 1299.9679 1314.7297 1332.5238 1335.7708 1342.0471 1352.4926 1357.4123 1401.6828 1450.3194 1466.5050 1467.0058 1473.3494 1473.6620 1479.6185 1675.6866 2954.8510 2971.1645 2975.4930 2975.8708 2977.6349 2993.2261 2994.5115 3041.5138 3045.5161 3052.6432 3060.6014 3063.8056 3095.4948 3204.5120
redmass: 3.3945 2.7098 1.2510 2.0972 3.0109 2.6798 1.8763 2.9515 3.0954 4.4447 3.7234 3.3561 3.6510 4.5865 2.4524 4.4599 1.3614 1.7131 2.0504 1.9980 3.5208 2.0923 1.8065 2.3175 2.9448 2.0493 3.0125 1.3996 1.3787 1.4460 3.2078 2.9569 2.5462 2.1078 1.4344 2.5287 1.3484 1.3237 1.2135 1.3532 1.2228 1.3540 1.4213 1.4332 1.6426 1.4187 1.6532 1.2930 1.0448 1.0893 1.0886 1.0824 1.0680 1.0932 7.0277 1.0819 1.0835 1.0544 1.0496 1.0613 1.0621 1.0636 1.0952 1.0997 1.0984 1.1016 1.1026 1.0982 1.0946
irintensity: 3.5109 0.4813 0.9469 3.8941 2.1370 0.0747 0.2219 4.6378 1.3494 0.8886 0.9735 0.8566 5.4433 3.6563 3.2372 12.0343 32.2170 6.2102 16.6856 7.4850 9.3049 4.8799 7.4559 5.6724 37.9441 49.2610 5.9472 5.7128 1.2357 1.3024 105.1967 41.7139 2.9962 7.8177 5.3650 52.7701 0.4712 3.7600 10.8288 1.8055 7.9211 23.9726 1.0608 1.6003 0.1153 15.6630 1.3133 22.7350 14.5099 7.1546 6.8420 19.8309 17.9158 5.1899 41.8036 4.4880 23.0098 57.1495 11.0579 46.7959 3.4973 54.7024 53.8388 52.6049 20.7206 1.2476 91.8961 21.9855 12.9065
temp: 298.150 k
press: 1.00000 atm
elementType: 8 8 6 6 6 6 6 6 6 6 6 1 1 1 1 1 1 1 1 1 1 1 1 1 1
symmnumber: 1
zpe: 563375.5 jmol-1
zpe.correction: 0.214578 hartree
zpe.thermalcorrener: 0.224778 hartree
zpe.thermalcorrenthalpy: 0.225722 hartree
zpe.thermalcorrgfe: 0.179503 hartree
zpe.sumelectzpe: -500.912752 hartree
zpe.sumelectthermal: -500.902552 hartree
zpe.sumelectthermalent: -500.901608 hartree
zpe.sumelectthermalfe: -500.947828 hartree
dipole: 1.2887 -0.6331 0.0839
dipole: 1.4383
quadrupole: -58.6112 -71.0771 -66.3929
quadrupole: -1.1101 0.1244 1.1035
quadrupole: 6.7492 -5.7167 -1.0325 -1.1101 0.1244 1.1035
hfenergy: -501.1273302 hartree
pointgroup: C01 [X(C9H14O2)]
dipole: 0.5104732 -0.2415388 0.0355581 debye
dipolederiv: -1.1694639 0.3731488 0.0261086 0.1272705 -0.6110428 -0.0160827 0.0244756 0.0292757 -0.253531 -1.2736843 -0.3546899 -0.0421216 0.0391751 -0.5213809 0.0019544 -0.0350921 0.0282966 -0.2388896 0.6407465 -0.1586096 -0.0696857 0.1764076 0.0874419 0.0031325 -0.0943502 0.0227211 0.3264157 0.5832086 0.0148659 0.0711376 -0.3616494 0.1188005 -0.0318619 0.1128727 0.0120471 0.3394721 -0.0534476 0.0047017 0.0063979 0.036142 0.0671717 0.0230657 0.0211262 -0.0224282 0.1215462 -0.0450566 0.0350055 -0.0054569 -0.0032419 0.0752433 0.0230553 -0.0346405 -0.0192667 0.1236905 0.0874231 -0.0108048 0.0055292 0.0288782 0.0376021 -0.0246291 -0.0495018 0.0009948 0.1527153 0.0753622 -0.0045512 -0.0166793 -0.0382335 0.0441867 -0.0206856 0.0419012 -0.0101393 0.1525388 0.6379639 -0.2588658 -0.0364551 -0.4493541 0.5234269 -0.0137006 0.0802542 -0.0251362 -0.0450303 0.6536989 0.3049291 0.0502536 0.4032339 0.1378038 -0.0102207 -0.0538322 0.0088524 -0.2362283 -0.1063306 0.0296965 0.0112599 -0.0306377 0.0484367 0.003038 0.0176927 -0.0146837 0.0913049 -0.0230106 0.0231289 -0.0022511 -0.0398855 0.0365182 0.0487175 0.0500163 -0.0006246 -0.1547553 -0.0113313 -0.0098218 0.0260038 0.0585655 0.032031 0.0502114 -0.0475854 0.0072202 -0.1602669 0.0434479 -0.0555127 -0.0183785 -0.012627 -0.1301805 -0.0718047 -0.0241683 -0.0950237 0.0463795 0.0407045 -0.0029471 0.0236868 0.0095959 0.0819057 -0.0039785 0.0143745 0.0585265 -0.1466609 0.0450752 -0.0051904 -0.0077478 -0.0472508 -0.1350603 -0.073789 -0.0087418 -0.0973988 0.047811 0.0436805 0.0148099 -0.0138388 0.0047 0.0811702 0.0020073 0.014998 0.0599401 -0.1483986 0.0614883 -0.0304732 -0.0062543 -0.0466997 0.0475851 0.0303281 0.0540949 -0.0139873 -0.1865828 -0.1111969 0.1246138 -0.0367359 0.1284648 -0.063674 0.029976 -0.0659633 0.0524212 0.0655319 0.0857803 0.0187334 0.0279178 0.0320082 0.0259379 0.0265339 -0.0435869 0.0034941 -0.1879083 -0.1914505 -0.0870203 0.0348422 -0.0853577 0.0133032 0.012546 0.0691532 0.0242913 0.0703278 -0.067539 0.0610464 -0.0230623 0.0812138 0.0387938 0.0135907 -0.0323383 -0.0086739 0.1966859 -0.0454853 0.0667487 0.0025221 0.1556143 -0.0286961 0.0070687 -0.0113164 0.0087918 0.1169711 0.0566355 -0.0360069 -0.0055154 -0.0707737 0.0231947 0.1027198 0.0605005 0.1256039 -0.0688623 0.0427814 -0.056935 -0.0014768 -0.0955588 -0.0305189 -0.1111925 -0.0603427 -0.1351146 -0.0242764 unknown
polarizability: 121.8858066|2.4198075|100.163035|0.0043647|-1.3226567|72.948706 unknown
InChI: InChI=1S/C9H14O2/c1-7-6-10-8-4-2-3-5-9(8)11-7/h6,8-9H,2-5H2,1H3
charge 0 multiplicity 1
25 atoms
O  -1.117314 -1.136579 0.071989
O  -0.610032 1.734487 -0.179098
C  0.199547 -0.597594 -0.348319
C  0.427124 0.787196 0.290108
C  1.283375 -1.592725 0.079006
C  1.801049 1.354711 -0.081726
C  2.686924 -1.040573 -0.277627
C  2.917541 0.364654 0.334457
C  -2.161889 -0.170669 -0.001371
C  -1.907072 1.161031 -0.15407
C  -3.523886 -0.792578 0.107493
H  0.182962 -0.474023 -1.452613
H  0.32489 0.681566 1.391921
H  1.101132 -2.567619 -0.408748
H  1.203273 -1.754543 1.171997
H  1.936249 2.337915 0.404542
H  1.830086 1.525011 -1.17593
H  2.790564 -0.979547 -1.380368
H  3.463899 -1.743642 0.076796
H  2.944078 0.280991 1.440181
H  3.901974 0.759829 0.020926
H  -2.691567 1.909808 -0.26336
H  -4.310657 -0.020205 0.073228
H  -3.624176 -1.34738 1.059688
H  -3.698681 -1.512422 -0.713807
