program: Gaussian 09
title: 000287932
version: EM64L-G09RevD.01
frameworkgroup: C1[X(C9H14O)]
method: RPBEPBE
basis: SDD
operation: Freq
keyword: #pfreq=noraman
keyword: PBEPBE/SDD
title: #p freq=noraman PBEPBE/SDD
converged: YES YES NO NO
title: Mulliken charges:
elementType: O C C C C C C C C C H H H H H H H H H H H H H H
charge: -0.260626 -0.407291 -0.533132 -0.260470 0.563664 -0.819650 -0.748869 -0.322227 0.189872 -0.460780 0.224368 0.233239 0.206241 0.195541 0.189166 0.185052 0.234921 0.218542 0.227387 0.221614 0.220250 0.213784 0.214678 0.274726
chargesum: 0.00000
title: Mulliken charges with hydrogens summed into heavy atoms:
elementType: O C C C C C C C C C
charge: -0.260626 0.050316 -0.131350 0.113748 0.563664 -0.138800 -0.307005 0.106235 0.189872 -0.186054
polarizability: 1.39153553e+02 1.48763808e+01 8.64280633e+01 3.21323437e+00 1.59747182e+00 7.51759575e+01
1716.lowfreq: -10.8452 -0.0005 -0.0004 0.0006 4.7704 10.1405 26.9620 49.5375 61.9146
frequency: 26.2844 49.4087 61.9102 67.0181 111.4909 125.2019 150.3169 183.4949 214.8182 305.4854 318.2918 366.9547 406.4733 438.1529 528.6196 537.2389 631.7641 673.6938 702.7373 763.9561 817.5806 866.6417 905.4528 941.7330 954.0994 973.8942 988.3414 997.7016 1033.0065 1038.8837 1048.6822 1090.2254 1097.3460 1163.3806 1196.4920 1257.7624 1258.3370 1278.6725 1298.9110 1324.6957 1343.5407 1395.7002 1400.4305 1429.2199 1456.9455 1460.6918 1470.5749 1475.1939 1479.6129 1488.7622 1670.0012 2153.0626 2901.7843 2913.7099 2949.2064 2950.0305 2953.4504 2966.4128 3005.9707 3019.6300 3039.8292 3073.1203 3086.5042 3087.6844 3189.6829 3426.3161
redmass: 3.3394 2.5791 4.1473 2.5746 2.1467 2.7535 3.9373 1.2091 3.1386 4.5541 3.1993 2.8146 2.5334 2.3895 4.3650 2.9445 1.2301 1.2550 1.0921 1.1174 3.2661 1.2678 6.7836 1.3248 3.7721 1.6564 1.5927 1.4500 2.6525 3.4976 2.2951 2.3801 1.8519 1.1768 1.0722 1.3360 1.2932 1.1194 2.1518 1.2748 1.4526 1.2470 1.4306 1.1752 1.0701 1.0864 1.0617 1.0783 1.0701 1.0898 5.0050 6.0179 1.0544 1.0538 1.0740 1.0923 1.1055 1.0379 1.0602 1.0955 1.0964 1.1044 1.0772 1.0832 1.1138 1.1604
irintensity: 0.1680 3.4866 0.2974 2.0111 0.6667 7.0832 1.1548 1.2559 0.4138 2.9115 5.2687 0.3212 2.4514 3.5331 1.2534 13.9588 76.1754 59.9878 1.0103 4.2233 0.9807 0.6973 23.8370 80.7167 2.8265 3.2629 1.1482 7.5917 105.9091 87.1072 0.3661 8.7291 0.3367 3.1870 2.5922 5.8113 0.7324 0.3128 9.2929 45.0149 24.4663 24.7932 1.0450 0.4668 6.0124 3.7147 17.6204 0.7741 17.2939 9.7482 30.8454 0.3107 31.9028 88.9653 34.8040 98.9098 0.1567 26.3076 18.8024 23.3201 30.1306 47.0624 33.8789 9.2686 27.8509 59.5243
temp: 298.150 k
press: 1.00000 atm
elementType: 8 6 6 6 6 6 6 6 6 6 1 1 1 1 1 1 1 1 1 1 1 1 1 1
symmnumber: 1
zpe: 532231.9 jmol-1
zpe.correction: 0.202716 hartree
zpe.thermalcorrener: 0.215353 hartree
zpe.thermalcorrenthalpy: 0.216297 hartree
zpe.thermalcorrgfe: 0.162137 hartree
zpe.sumelectzpe: -425.677780 hartree
zpe.sumelectthermal: -425.665143 hartree
zpe.sumelectthermalent: -425.664199 hartree
zpe.sumelectthermalfe: -425.718359 hartree
dipole: -0.0787 -1.3027 1.2616
dipole: 1.8152
quadrupole: -59.7155 -58.9962 -62.2001
quadrupole: -2.9473 0.5120 -0.2987
quadrupole: 0.5884 1.3078 -1.8962 -2.9473 0.5120 -0.2987
hfenergy: -425.8804963 hartree
pointgroup: C01 [X(C9H14O1)]
dipole: 0.0386586 0.5258698 0.481622 debye
dipolederiv: -1.2685122 -0.0863363 -0.0359907 -0.0529194 -0.3845806 0.0101609 -0.0409879 0.0137206 -0.4080297 -0.1196983 0.0004061 0.0078582 0.0398634 0.0620176 -0.0698065 0.02415 -0.045159 0.0946782 -0.0764889 0.0466067 0.0318567 0.0936578 0.0497624 0.0151679 0.0900558 -0.0180194 0.1612521 0.7884996 0.1280162 0.0654828 0.2558485 0.3773912 -0.0239708 0.1408028 -0.0346195 0.444522 0.2652788 -0.0530277 -0.1616637 -0.1375201 0.2668569 -0.1365051 -0.2404448 -0.1257217 0.065155 -0.0150107 0.0111744 0.0348402 0.0702968 -0.1450709 0.0612307 0.0358508 0.0599735 0.051236 -0.2809354 -0.1778531 -0.0851562 -0.1429993 -0.1017433 -0.0568306 -0.0523931 -0.0582987 -0.37893 1.0099442 0.0373541 0.0175752 -0.2099804 0.4002109 -0.0224712 -0.1014319 -0.0244834 0.4372527 -0.0937331 0.0793664 0.04314 0.0503987 -0.0627913 -0.002274 0.0255745 -0.0010253 -0.061323 -0.456273 -0.0588832 -0.0295181 -0.0771167 -0.3144159 0.0053661 -0.0420218 0.0044889 -0.3210553 0.0874523 -0.0080985 -0.0067543 0.0034201 -0.1183751 0.0649708 0.0039569 0.0792515 0.0383886 0.0652148 -0.0030875 0.0033856 0.0068466 0.0650327 -0.0289171 -0.0071775 -0.0397956 -0.1272983 0.0368751 0.00681 0.0021456 0.014415 -0.1599037 0.0501363 -0.0119169 0.0987106 0.0496428 0.0269135 0.0017833 0.0326865 0.0121616 0.0763202 -0.0081642 0.0100839 -0.0398291 -0.1882226 -0.0494431 0.0049497 -0.0204307 -0.0643535 -0.2002783 0.0688744 -0.0230965 0.1098314 0.0000525 -0.0457888 -0.0142735 0.0158324 -0.0576939 0.0197869 -0.0359568 -0.0519275 -0.0768158 -0.2294517 -0.0139352 -0.1262462 -0.065608 -0.1296826 -0.0166834 -0.0003216 -0.0633819 -0.040025 0.0659675 0.1204614 0.0149526 0.0361872 -0.0173296 0.0589348 -0.0045887 0.0261013 0.0499132 -0.1662808 -0.126316 0.1295355 0.0417385 0.0632844 0.0424873 0.0028104 0.0813778 -0.0252779 0.0828033 0.1046824 0.0726974 0.0281563 0.0449234 -0.0966196 0.1023795 0.0335252 0.0853942 0.1293863 -0.056394 0.0959076 0.0972867 0.1324232 0.0398668 -0.0024891 0.1096494 0.0168265 0.1372135 -0.0716884 -0.0320865 -0.0384653 0.0478888 0.0546239 -0.037642 0.0607386 -0.0750202 -0.1733117 -0.0702943 -0.05347 -0.0047651 0.075987 -0.1517646 0.0647369 0.0045825 0.1017523 0.0362957 0.2391893 -0.0161975 -0.0098199 -0.0218195 0.2389349 -0.0158962 -0.0116699 -0.0157721 0.2600569 unknown
polarizability: 139.5168833|14.0835298|85.9529562|-3.7663658|-1.8889132|75.287734 unknown
InChI: InChI=1S/C9H14O/c1-4-7-10-8-5-6-9(2)3/h1H,2,5-8H2,3H3
charge 0 multiplicity 1
24 atoms
O  -1.640374 -0.039622 -0.032111
C  0.778038 -0.065259 -0.036552
C  2.091945 0.638471 0.399736
C  -0.458468 0.731279 0.387864
C  3.35442 -0.085407 -0.056929
C  3.550637 -1.502562 0.454567
C  4.262328 0.516065 -0.871377
C  -2.888928 0.656516 0.325718
C  -4.04381 -0.138783 -0.108416
C  -5.040196 -0.774738 -0.455849
H  0.710172 -1.074443 0.409407
H  0.76544 -0.192439 -1.134802
H  2.1012 1.67382 0.006518
H  2.097978 0.715369 1.508863
H  -0.465833 1.73609 -0.094039
H  -0.471889 0.879329 1.492807
H  2.771827 -2.184685 0.062026
H  3.477483 -1.538341 1.559608
H  4.533904 -1.906787 0.159763
H  4.116477 1.538965 -1.239135
H  5.175611 0.002563 -1.194525
H  -2.93508 0.814522 1.427139
H  -2.919222 1.658164 -0.159895
H  -5.900463 -1.339993 -0.765386
