program: Gaussian 09
title: 000287931
version: EM64L-G09RevD.01
frameworkgroup: C1[X(C6H12ClN)]
method: RPBEPBE
basis: SDD
operation: Freq
keyword: #p
keyword: freq=noraman
keyword: PBEPBE/SDD
title: #p freq=noraman PBEPBE/SDD
converged: YES YES NO NO
title: Mulliken charges:
elementType: Cl N C C C C C C H H H H H H H H H H H H
charge: -0.065645 -0.091856 -0.486764 0.591067 -0.619048 -0.610176 -0.789391 -0.630871 0.214481 0.198250 0.245560 0.187098 0.224014 0.225928 0.225340 0.189085 0.224937 0.238456 0.259955 0.269581
chargesum: 0.00000
title: Mulliken charges with hydrogens summed into heavy atoms:
elementType: Cl N C C C C C C
charge: -0.065645 -0.091856 -0.074033 0.591067 0.037625 0.030177 -0.066044 -0.361291
polarizability: 1.10684697e+02 -7.19741890e+00 7.10296987e+01 2.27679699e+00 4.01829476e+00 6.39734665e+01
1716.lowfreq: -16.4404 -7.2667 -0.0024 -0.0017 0.0003 10.1385 47.0804 68.3857 116.9247
frequency: 47.0396 68.3567 116.9020 127.9306 217.8978 230.8331 239.9650 260.0531 298.4892 312.9609 378.2016 415.0477 459.3142 580.1927 735.5653 774.9928 821.2535 856.6825 947.7892 1026.4513 1031.5565 1037.3254 1045.5039 1091.0991 1134.0673 1169.3675 1183.6253 1257.6265 1272.8710 1302.2404 1352.0111 1390.2843 1417.9807 1440.0804 1454.3187 1459.0136 1460.6744 1467.3263 1474.1843 1477.2598 1487.9253 1661.5281 2840.2538 2850.1231 2865.7846 2975.4780 2994.6393 3019.2832 3027.9631 3057.8079 3078.2682 3087.6827 3110.4003 3183.1928
redmass: 3.1595 3.3035 1.1281 2.6618 2.6573 1.2953 1.1803 2.8053 4.0562 2.7299 1.7806 2.3062 2.7020 3.2859 5.8957 1.7625 2.4696 3.3468 1.5575 2.1176 1.6505 1.5023 1.5725 1.2529 1.4016 1.8250 1.7168 2.4266 1.7296 1.6434 1.3798 1.2577 1.1394 1.1585 1.0726 1.0470 1.0540 1.0677 1.0657 1.0551 1.0522 6.6846 1.0682 1.0573 1.0580 1.0402 1.0871 1.0723 1.0724 1.0927 1.1011 1.1010 1.0996 1.0956
irintensity: 0.3610 0.7827 0.4049 0.3246 1.6893 1.9875 0.5601 0.5558 1.6958 10.8866 2.0182 3.1709 8.3081 5.3308 51.2066 38.7035 28.6809 16.5651 1.2644 69.1954 24.5962 10.0580 13.6755 6.1855 3.2996 5.7462 2.9591 8.1123 4.9938 24.0944 10.6956 29.6462 4.9097 4.4560 8.1903 6.2527 12.0989 14.4740 26.3412 10.5002 11.4635 24.1357 55.5404 69.2010 232.5470 15.4357 31.8252 42.6772 38.2582 13.6134 29.6504 34.4195 8.2305 8.5448
temp: 298.150 k
press: 1.00000 atm
elementType: 17 7 6 6 6 6 6 6 1 1 1 1 1 1 1 1 1 1 1 1
symmnumber: 1
zpe: 443064.9 jmol-1
zpe.correction: 0.168755 hartree
zpe.thermalcorrener: 0.179198 hartree
zpe.thermalcorrenthalpy: 0.180143 hartree
zpe.thermalcorrgfe: 0.132406 hartree
zpe.sumelectzpe: -749.949022 hartree
zpe.sumelectthermal: -749.938578 hartree
zpe.sumelectthermalent: -749.937634 hartree
zpe.sumelectthermalfe: -749.985371 hartree
dipole: -2.6745 -0.1936 -0.8104
dipole: 2.8013
quadrupole: -60.8180 -55.7035 -56.5739
quadrupole: 1.3280 1.0753 0.1358
quadrupole: -3.1195 1.9949 1.1246 1.3280 1.0753 0.1358
hfenergy: -750.1177767 hartree
pointgroup: C01 [X(C6H12Cl1N1)]
dipole: -1.056322 -0.0541299 -0.3096859 debye
dipolederiv: -0.8379651 0.1016543 -0.0743093 -0.0171272 -0.111254 -0.0438954 -0.2462497 -0.0068822 -0.1319869 -0.7068838 -0.0155572 -0.0525272 -0.0751381 -0.5468353 -0.0244131 -0.0272088 -0.0280106 -0.5145677 0.5180286 0.036809 -0.2004557 0.2256853 0.2376803 0.0682538 -0.1159622 0.0394678 0.363738 -0.2342632 0.0262221 0.0213091 -0.1093453 0.1487382 0.1205256 -0.0556511 0.1439424 0.0171492 0.0190665 0.0119373 0.0300254 0.0930337 0.4777125 0.0149011 0.0235735 0.0106563 0.2712581 0.4687122 -0.0121226 0.1507341 -0.0703925 0.2103082 0.1143065 0.2277552 0.1171891 0.268075 -0.0820758 -0.0047502 0.0002712 0.009738 -0.0762783 -0.1403965 -0.0691554 -0.1061745 -0.0430694 0.995548 -0.1292138 0.214649 -0.0583219 -0.1340975 0.1396686 0.3486527 0.1051299 -0.0988369 -0.041129 0.0723944 -0.0356192 0.0507793 -0.0946739 0.1119307 -0.00769 0.0784157 0.0241777 -0.0402479 -0.0345563 0.0336742 0.0105553 -0.0791961 -0.2229611 0.0841915 -0.0910974 -0.1521027 -0.0794248 0.0620993 -0.123875 0.041862 0.056387 -0.0007475 -0.1097508 -0.0045055 0.0682172 0.0619108 -0.0400319 -0.021463 -0.0435701 -0.2214681 -0.0292545 -0.0507801 -0.2103191 -0.0821802 -0.036934 -0.0595641 0.1652061 -0.0083847 0.0573409 0.0126388 0.1366857 0.0338015 -0.0430799 0.0900455 -0.0128321 -0.0134965 0.0516409 -0.1427106 0.0911725 -0.0704281 0.097182 0.0493782 -0.0935449 -0.0084703 0.0875089 -0.0588441 0.1054033 0.0172399 0.1540053 0.0101979 -0.0574923 -0.0877091 0.0170333 -0.0546799 -0.1250781 -0.0642917 -0.18472 -0.2071676 -0.1209842 -0.1325874 0.121816 0.0206245 -0.0330077 0.0413845 -0.1096007 0.0454587 0.0108205 0.0955284 0.0329105 -0.0517998 -0.029371 -0.1220273 0.0202484 0.0958646 0.0069182 -0.065863 -0.026763 0.0535663 0.0536847 0.0095345 0.1195207 0.0193722 0.1110641 0.0275179 0.1280387 -0.009792 0.0212849 -0.036835 -0.011839 -0.0914378 0.0019023 0.0799072 -0.1241443 -0.0878163 -0.1269825 0.0861481 unknown
polarizability: 110.8071223|-7.0632342|70.185054|0.9694832|4.6819347|64.6956857 unknown
InChI: InChI=1S/C6H12ClN/c1-6(4-7)5-8(2)3/h4H,5H2,1-3H3
charge 0 multiplicity 1
20 atoms
Cl 3.501798 -0.351394 -0.038354
N  -1.642442 -0.039324 0.214036
C  -0.599602 0.226862 -0.807681
C  0.791096 0.385187 -0.191108
C  -1.495541 -1.363519 0.850513
C  -3.006014 0.18818 -0.303405
C  0.947986 1.467746 0.849249
C  1.776064 -0.433722 -0.629763
H  -0.868939 1.178538 -1.309487
H  -0.576217 -0.565224 -1.600653
H  -0.485228 -1.463576 1.282728
H  -1.649225 -2.212629 0.136157
H  -2.232481 -1.46403 1.66703
H  -3.092911 1.2198 -0.689198
H  -3.73636 0.067684 0.516594
H  -3.295814 -0.51563 -1.125166
H  0.874625 2.46772 0.377408
H  1.915144 1.405254 1.372756
H  0.119597 1.394653 1.576171
H  1.653065 -1.221179 -1.376827
