program: Gaussian 09
title: 000287919
version: EM64L-G09RevD.01
frameworkgroup: C1[X(C8H17NO)]
method: RPBEPBE
basis: SDD
operation: Freq
keyword: #p
keyword: freq=noraman
keyword: PBEPBE/SDD
title: #p freq=noraman PBEPBE/SDD
converged: YES YES NO NO
title: Mulliken charges:
elementType: O N C C C C C C C C H H H H H H H H H H H H H H H H H
charge: -0.243668 -0.133010 0.359796 -0.343388 -0.344651 -0.739672 -0.742512 -0.728132 -0.324892 -0.324388 0.188812 0.212674 0.214051 0.188181 0.232030 0.210672 0.210232 0.211022 0.232039 0.211307 0.220322 0.214142 0.220331 0.189369 0.210025 0.210037 0.189269
chargesum: 0.00000
title: Mulliken charges with hydrogens summed into heavy atoms:
elementType: O N C C C C C C C C
charge: -0.243668 -0.133010 0.359796 0.058098 0.057581 -0.086738 -0.088143 -0.073337 0.074502 0.074918
polarizability: 1.06355588e+02 -4.28004166e-03 9.58242068e+01 -3.12733197e-02 5.10619856e-03 8.31070004e+01
1716.lowfreq: -15.1887 -0.0008 -0.0003 -0.0003 14.2926 25.6702 45.9905 109.6936 171.4040
frequency: 43.1216 109.6916 171.4015 219.8451 238.0388 244.3104 270.8191 274.7132 308.6651 325.3355 368.0725 386.0326 447.8255 457.8108 465.9920 482.2251 573.8402 689.0175 785.3918 810.0657 845.2678 895.3748 905.6452 918.9411 935.7506 953.4475 1009.5628 1018.0502 1025.7477 1052.9328 1077.7541 1084.1438 1105.2255 1148.8345 1193.0564 1201.1034 1229.2290 1231.8867 1269.9151 1274.7625 1296.4943 1331.7241 1345.7581 1364.3102 1370.0973 1373.9535 1376.2346 1397.1253 1441.8947 1446.2465 1449.0608 1457.5447 1458.7387 1464.1139 1473.3500 1482.8988 1484.4138 1502.2839 2868.7158 2877.7073 2950.1151 2954.2956 2976.8324 2981.0760 2986.1850 3059.2623 3062.1674 3071.7344 3071.8058 3073.8219 3077.0299 3077.5491 3082.1915 3086.2724 3092.3001
redmass: 2.4440 3.4936 1.3256 1.6377 1.1902 1.3928 2.1522 1.6857 2.5069 2.3395 2.1181 1.9225 2.7017 2.7286 2.7952 2.5779 2.2997 2.7403 2.9093 4.0624 1.6082 1.7180 2.3399 1.6279 1.2342 3.0196 1.3839 1.4260 2.2050 1.9315 2.3084 4.1847 2.1941 4.4292 1.0631 2.1786 2.8505 1.6644 2.0438 1.3137 1.2904 1.2566 1.2424 1.2971 1.2318 1.2820 1.2614 1.2043 1.0813 1.0758 1.0958 1.0571 1.0960 1.0514 1.0524 1.0493 1.0622 1.0542 1.0707 1.0691 1.0660 1.0662 1.0350 1.0350 1.0361 1.0893 1.0905 1.0992 1.0989 1.0963 1.0977 1.0977 1.0974 1.1004 1.0996
irintensity: 0.0611 1.3908 0.0406 1.0126 0.7736 4.1698 3.6959 0.2253 7.9786 0.1598 2.5228 0.0917 2.9733 0.3619 0.9493 4.0182 6.2801 6.3298 3.0073 18.7104 0.1612 2.5070 8.6183 1.4967 1.0553 43.3783 1.4892 0.3168 6.4055 17.5645 4.3479 50.4957 0.5677 4.0355 1.3222 88.3814 43.3992 1.6244 37.1351 5.3835 0.0945 3.1056 9.8441 14.6269 22.4169 1.7160 25.2801 17.4969 2.2631 0.8930 18.1916 1.3010 1.4796 2.5123 0.5939 10.4779 6.0677 23.8044 41.1922 104.9612 35.7066 110.7793 32.1057 31.1094 11.8214 22.7385 31.5896 0.7749 17.5313 37.3509 28.5534 82.6724 67.3841 11.5670 62.0154
temp: 298.150 k
press: 1.00000 atm
elementType: 8 7 6 6 6 6 6 6 6 6 1 1 1 1 1 1 1 1 1 1 1 1 1 1 1 1 1
symmnumber: 1
zpe: 633507.3 jmol-1
zpe.correction: 0.241290 hartree
zpe.thermalcorrener: 0.252424 hartree
zpe.thermalcorrenthalpy: 0.253368 hartree
zpe.thermalcorrgfe: 0.205405 hartree
zpe.sumelectzpe: -444.152982 hartree
zpe.sumelectthermal: -444.141849 hartree
zpe.sumelectthermalent: -444.140905 hartree
zpe.sumelectthermalfe: -444.188868 hartree
dipole: 2.1757 0.0037 -0.1230
dipole: 2.1792
quadrupole: -70.6457 -58.5225 -64.8804
quadrupole: 0.0052 2.0817 -0.0028
quadrupole: -5.9628 6.1604 -0.1975 0.0052 2.0817 -0.0028
hfenergy: -444.3942726 hartree
pointgroup: C01 [X(C8H17N1O1)]
dipole: -0.8572989 0.0024478 0.0107664 debye
polarizability: 106.3135149|-0.0018484|95.8238341|0.988592|-0.0692137|83.1494458 unknown
InChI: InChI=1S/C8H17NO/c1-8(2,3)9-4-6-10-7-5-9/h4-7H2,1-3H3
charge 0 multiplicity 1
27 atoms
O  2.814018 -0.003895 -0.100984
N  -0.09115 0.001628 0.222581
C  -1.581786 0.001131 -0.049396
C  0.641794 -1.210924 -0.23054
C  0.644623 1.20808 -0.242067
C  -2.212252 -1.240963 0.63591
C  -2.208026 1.263862 0.601131
C  -1.92251 -0.018566 -1.571721
C  2.073821 -1.198789 0.334082
C  2.076931 1.197155 0.322113
H  0.70254 -1.277919 -1.345329
H  0.132341 -2.116599 0.139542
H  0.138272 2.118367 0.120758
H  0.704544 1.265396 -1.357531
H  -1.885731 -1.298839 1.689632
H  -3.313876 -1.161609 0.612123
H  -1.943899 -2.186221 0.131375
H  -1.943156 2.192814 0.06532
H  -1.875472 1.354742 1.650674
H  -3.309699 1.183418 0.586602
H  -1.525167 -0.925027 -2.064033
H  -3.018177 -0.01009 -1.718463
H  -1.507556 0.865076 -2.090344
H  2.031387 -1.228148 1.444669
H  2.655278 -2.058151 -0.04038
H  2.660632 2.051254 -0.060794
H  2.034674 1.237614 1.432371
