program: Gaussian 09
title: 000287893
version: EM64L-G09RevD.01
frameworkgroup: C1[X(C14H11ClN2O)]
method: RPBEPBE
basis: SDD
operation: Freq
keyword: #p
keyword: freq=noraman
keyword: PBEPBE/SDD
title: #p freq=noraman PBEPBE/SDD
converged: YES YES NO NO
title: Mulliken charges:
elementType: Cl O N N C C C C C C C C C C C C C C H H H H H H H H H H H
charge: -0.070494 -0.220481 -0.416632 0.063106 0.260947 0.520730 -0.348735 -0.357366 -0.285289 -0.351234 0.174295 -0.216786 -0.231786 -0.225776 -0.228074 -0.370794 -0.224086 -0.218973 0.273912 0.223681 0.291894 0.235239 0.232461 0.257398 0.236919 0.229943 0.235131 0.237525 0.293323
chargesum: 0.00000
title: Mulliken charges with hydrogens summed into heavy atoms:
elementType: Cl O N N C C C C C C C C C C C C C C
charge: -0.070494 -0.220481 -0.123309 0.063106 0.260947 0.520730 -0.074823 -0.133685 -0.285289 -0.059340 0.174295 0.018453 0.000675 0.031622 0.008845 -0.140851 0.011045 0.018552
polarizability: 3.57190493e+02 -1.03908874e+01 1.90001358e+02 7.56960201e+00 6.32374232e+00 7.42426001e+01
1716.lowfreq: -6.8516 -3.7751 -0.0028 -0.0015 -0.0014 4.9529 23.3064 32.3381 39.3965
frequency: 23.2533 32.2492 39.3664 65.8888 114.9823 120.5534 160.7658 166.8171 187.3184 228.7640 259.7920 321.5598 328.1369 353.7154 395.3788 403.4498 426.7321 456.0098 483.5193 512.0865 532.3152 613.3231 621.1647 638.7478 670.8345 683.8382 687.6119 703.3803 726.2610 766.7887 791.1197 823.5126 856.0673 879.1760 899.5269 935.4969 942.3638 963.9468 984.6726 989.3224 1002.8151 1006.1878 1010.5079 1018.0365 1036.9594 1038.6150 1086.2482 1117.3931 1135.4595 1171.4354 1174.9653 1190.8328 1226.3821 1237.2246 1286.1206 1315.7751 1329.9219 1380.0556 1384.7922 1425.7415 1433.8127 1458.6275 1478.2308 1506.9643 1556.0789 1579.4672 1583.2685 1605.0858 1610.5047 1624.5146 3012.6456 3118.0454 3133.7062 3140.2090 3146.6320 3154.2164 3159.1421 3166.9659 3170.8177 3177.7121 3385.8526
redmass: 5.3994 5.4473 6.4028 5.5594 5.4729 5.0204 9.2911 5.8914 4.9681 3.9061 4.6253 7.2448 4.7293 9.5315 6.8940 2.9856 4.8368 3.4421 5.5570 5.6717 3.3595 5.8082 5.4877 1.3046 6.4954 5.3556 6.6672 1.5513 3.7961 1.2480 2.3211 5.6593 1.2501 1.3454 5.4674 1.4387 1.5072 1.3823 1.4924 4.6385 1.3500 1.3490 6.5496 3.8571 2.0325 2.6703 1.6447 2.1297 2.5617 1.0634 1.0588 1.1174 1.6995 3.1022 1.6480 1.3528 1.7026 4.5226 8.7249 2.4419 2.2240 2.3589 2.2431 1.9168 6.1226 6.1534 5.9022 6.8597 6.0179 7.8824 1.0876 1.0877 1.0870 1.0861 1.0918 1.0905 1.0958 1.0956 1.1009 1.1001 1.0751
irintensity: 2.2295 1.4125 1.6283 4.3822 4.1080 5.2241 0.1448 0.6328 5.2835 18.3277 9.8763 0.1013 1.9420 3.0647 6.4812 0.4998 8.0026 8.8637 1.6283 8.2388 0.0999 3.0394 4.2556 71.0831 27.6834 9.3568 29.1548 87.0411 9.0940 75.6052 25.0074 4.0783 1.8707 0.0509 35.0743 1.3017 31.0241 8.7758 3.0744 1.7314 1.8503 2.5955 52.5706 13.2851 8.9197 8.3424 46.4582 46.3121 166.7616 3.1483 2.3469 29.5835 5.7100 423.7773 14.6129 7.7325 32.5897 0.9141 0.5302 38.3005 6.3327 54.5065 11.4927 326.1827 3.3465 35.9022 9.9016 9.9335 6.2724 146.2824 39.4345 14.8358 1.4170 1.6467 19.6845 6.3402 15.6882 5.7316 25.3674 19.0268 5.1239
temp: 298.150 k
press: 1.00000 atm
elementType: 17 8 7 7 6 6 6 6 6 6 6 6 6 6 6 6 6 6 1 1 1 1 1 1 1 1 1 1 1
symmnumber: 1
zpe: 565640.9 jmol-1
zpe.correction: 0.215441 hartree
zpe.thermalcorrener: 0.230970 hartree
zpe.thermalcorrenthalpy: 0.231914 hartree
zpe.thermalcorrgfe: 0.169979 hartree
zpe.sumelectzpe: -1183.601966 hartree
zpe.sumelectthermal: -1183.586437 hartree
zpe.sumelectthermalent: -1183.585492 hartree
zpe.sumelectthermalfe: -1183.647428 hartree
dipole: -0.4915 3.0047 -0.1393
dipole: 3.0478
quadrupole: -80.0148 -112.0071 -115.6975
quadrupole: -15.3133 2.6639 2.7397
quadrupole: 22.5584 -9.4340 -13.1244 -15.3133 2.6639 2.7397
hfenergy: -1183.8174068 hartree
pointgroup: C01 [X(C14H11Cl1N2O1)]
dipole: -0.2492075 -1.1720427 0.0451937 debye
polarizability: 357.7335407|2.4958596|189.2609117|-8.4341541|7.7144446|74.4399984 unknown
InChI: InChI=1S/C14H11ClN2O/c15-13-9-5-4-8-12(13)10-16-17-14(18)11-6-2-1-3-7-11/h1-10,17H
charge 0 multiplicity 1
29 atoms
Cl 3.621215 -2.838578 0.242645
O  -1.657523 2.113159 0.039543
N  -0.749354 -0.05336 0.044807
N  0.552924 0.390959 -0.017743
C  -3.184506 0.220017 0.016601
C  2.913823 -0.106385 0.006858
C  -4.267192 0.987935 0.51831
C  -3.435066 -1.081554 -0.495674
C  3.978293 -1.043993 0.076081
C  3.271163 1.270308 -0.124252
C  -1.823019 0.86517 0.024134
C  -5.572179 0.45528 0.535459
C  -4.74399 -1.611571 -0.482335
C  5.331164 -0.662704 0.022193
C  4.616694 1.672011 -0.180394
C  1.505786 -0.515429 0.069393
C  -5.813614 -0.848564 0.040262
C  5.652112 0.706961 -0.10691
H  -4.059765 2.000002 0.880955
H  -2.630515 -1.672377 -0.951024
H  2.454135 1.996855 -0.177436
H  -6.400274 1.053515 0.930423
H  -4.931224 -2.61121 -0.889246
H  6.116677 -1.421361 0.080065
H  4.863876 2.733888 -0.280465
H  1.298762 -1.595042 0.190959
H  -6.828029 -1.262164 0.050789
H  6.702584 1.013028 -0.149201
H  -0.954555 -1.055493 0.175204
