program: Gaussian 09
title: 000287880
version: EM64L-G09RevD.01
frameworkgroup: C1[X(C16H17N3O4)]
method: RPBEPBE
basis: SDD
operation: Freq
keyword: #p
keyword: freq=noraman
keyword: PBEPBE/SDD
title: #p freq=noraman PBEPBE/SDD
converged: YES YES NO NO
title: Mulliken charges:
elementType: O O O O N N N C C C C C C C C C C C C C C C C H H H H H H H H H H H H H H H H H
charge: -0.308575 -0.302978 -0.289886 -0.215428 0.064838 -0.409028 -0.001455 0.553306 0.045176 0.301245 0.251682 -0.553022 -0.565806 -0.395543 0.276180 -0.524169 -0.525963 -0.523117 0.184778 -0.310323 -0.282251 -0.327454 -0.322083 0.303084 0.250566 0.210932 0.260977 0.233216 0.228675 0.248068 0.226023 0.232970 0.214368 0.263506 0.230491 0.288635 0.223027 0.273024 0.244235 0.248079
chargesum: 0.00000
title: Mulliken charges with hydrogens summed into heavy atoms:
elementType: O O O O N N N C C C C C C C C C C C C C C C C
charge: -0.308575 -0.302978 -0.289886 -0.215428 0.064838 -0.120393 -0.001455 0.553306 0.045176 0.301245 0.251682 -0.249938 -0.315240 -0.184611 0.276180 0.198699 0.181098 0.185249 0.184778 -0.087295 -0.009227 -0.083219 -0.074005
polarizability: 4.38136349e+02 -9.52094506e+00 2.18330850e+02 -2.03760181e+00 8.44278685e+00 1.10669220e+02
1716.lowfreq: -10.2005 -5.3023 -2.6874 -0.0007 0.0005 0.0008 20.3209 23.6388 30.3371
frequency: 20.1987 23.4663 30.2350 45.1189 61.0318 71.9555 76.2833 90.5432 100.3862 117.4139 143.8917 154.8477 159.6882 167.8466 178.8323 182.6497 210.1582 223.8498 246.6001 259.1043 278.4080 319.6553 333.2749 348.7227 365.2016 369.4708 398.4968 424.7893 440.5660 490.4960 506.2270 526.7715 591.5453 620.5481 633.1564 646.9200 655.1291 659.7175 674.9554 689.4423 750.3626 752.9851 771.5622 836.4321 862.8367 869.9421 876.5164 890.1608 917.2250 924.9201 937.4658 949.8297 957.4368 965.3450 987.7382 1015.7146 1023.0031 1040.4422 1061.8065 1086.6853 1109.3810 1110.4620 1113.2793 1115.9279 1140.5600 1149.6507 1157.9918 1158.9749 1193.7078 1210.4977 1218.8924 1242.6161 1296.8916 1300.2976 1324.9275 1337.3071 1368.7803 1398.3812 1399.9589 1415.8107 1435.0850 1437.0500 1454.2626 1458.1392 1459.9847 1461.1458 1464.6851 1476.7080 1483.2097 1485.5372 1508.2973 1546.5575 1554.9327 1577.9900 1588.5726 1604.6232 1621.0524 2961.4850 2974.1098 2976.5121 2981.3075 3071.8109 3083.2935 3084.7525 3123.2212 3124.5081 3125.4906 3129.1010 3141.6429 3148.2091 3148.7966 3174.1697 3177.4421 3380.2990
redmass: 5.1797 4.4694 6.0416 4.4652 2.4194 3.7999 3.2651 3.6899 3.4867 3.4748 1.6384 1.2297 1.2311 2.3868 4.2578 6.1417 3.6256 3.9694 4.8753 4.1097 5.8852 4.4970 5.4304 7.0207 2.5934 5.3756 7.7842 6.2630 5.7098 5.8111 5.0150 5.8745 5.4228 1.4252 4.2913 3.6527 4.2853 6.2872 6.6033 4.5481 4.6403 3.0773 3.9721 1.6478 4.0592 5.7719 2.0178 1.2621 1.6350 4.3988 8.9630 1.6436 3.1862 1.8855 1.4452 3.3369 7.2212 6.0194 2.1390 1.6376 1.2651 1.3690 2.2078 1.3140 2.5633 1.3956 1.6161 1.5177 1.9770 1.4157 1.3290 2.9144 2.2417 6.4041 1.5605 3.1339 3.4307 2.4538 1.9485 1.3003 1.2586 1.4604 1.2505 1.0584 1.2443 1.5735 1.8121 1.0631 1.0553 1.0549 1.8829 7.4617 7.5892 5.6619 5.9378 6.6244 8.4763 1.0868 1.0309 1.0339 1.0296 1.1042 1.1051 1.0988 1.1026 1.0875 1.1036 1.1046 1.0897 1.0916 1.0973 1.0966 1.0928 1.0751
irintensity: 0.8787 0.3819 0.6940 1.7188 2.9395 9.7353 4.6224 8.0810 3.0453 2.7884 1.9486 0.3819 0.3967 1.0140 7.3972 7.7341 6.4510 14.9158 20.1431 6.0219 11.4125 6.4891 3.7314 1.0163 0.3911 9.1980 0.9306 10.0944 3.5031 4.8340 9.4777 3.1871 8.6779 40.3621 8.8024 30.1933 8.7129 2.0916 55.4738 30.1683 2.3706 10.2106 8.4138 37.7450 10.1452 21.9362 12.4720 4.3515 3.6235 29.1732 86.5937 62.1287 1.0071 1.1369 2.7972 129.2994 63.2590 111.6596 17.9764 22.6825 18.7877 20.8430 54.5067 7.7745 76.0451 10.2390 19.5425 9.9086 43.1950 11.3058 29.2778 265.8714 285.6072 20.3557 5.7457 73.5296 10.6977 76.9495 8.7395 16.0725 24.4907 47.6591 55.9350 19.5893 33.9535 6.4991 51.2186 1.7474 18.1367 48.3316 272.4367 48.9642 100.2839 32.3388 8.2728 3.8166 197.6609 63.0582 59.1650 108.9503 71.8832 26.1375 16.6901 36.6660 22.3692 11.8886 24.8968 15.8126 30.7002 3.1029 15.2795 6.4499 2.6567 14.3464
temp: 298.150 k
press: 1.00000 atm
elementType: 8 8 8 8 7 7 7 6 6 6 6 6 6 6 6 6 6 6 6 6 6 6 6 1 1 1 1 1 1 1 1 1 1 1 1 1 1 1 1 1
symmnumber: 1
zpe: 802719.9 jmol-1
zpe.correction: 0.305740 hartree
zpe.thermalcorrener: 0.328739 hartree
zpe.thermalcorrenthalpy: 0.329684 hartree
zpe.thermalcorrgfe: 0.250552 hartree
zpe.sumelectzpe: -1083.283838 hartree
zpe.sumelectthermal: -1083.260838 hartree
zpe.sumelectthermalent: -1083.259894 hartree
zpe.sumelectthermalfe: -1083.339026 hartree
dipole: -4.4492 3.2181 0.9133
dipole: 5.5665
quadrupole: -130.4099 -130.9672 -131.8817
quadrupole: 9.7807 -5.5054 3.5067
quadrupole: 0.6763 0.1191 -0.7955 9.7807 -5.5054 3.5067
hfenergy: -1083.5895777 hartree
pointgroup: C01 [X(C16H17N3O4)]
dipole: 1.7052833 -0.9604201 0.9827374 debye
polarizability: 436.7939641|-4.6216775|189.1605293|21.1229163|-48.8547562|141.181926 unknown
InChI: InChI=1S/C16H17N3O4/c1-21-13-8-11(9-14(22-2)15(13)23-3)10-18-19-16(20)12-4-6-17-7-5-12/h4-10,19H,1-3H3
charge 0 multiplicity 1
40 atoms
O  5.472936 0.081099 0.070232
O  3.640379 2.128723 -0.800724
O  4.37043 -2.398469 1.085662
O  -3.138382 1.715363 -1.069217
N  -1.048863 0.077847 -0.13514
N  -2.385662 -0.273165 -0.064945
N  -7.517842 -0.708403 -0.035019
C  1.266366 -0.549147 0.228712
C  4.075528 -0.106281 0.155521
C  3.162431 0.909195 -0.269384
C  3.559273 -1.325459 0.679739
C  1.776917 0.689389 -0.249184
C  2.163632 -1.538195 0.707665
C  -0.173251 -0.823599 0.261039
C  -4.791564 0.104949 -0.317562
C  5.988573 0.171082 -1.321674
C  4.382082 2.980051 0.158831
C  5.440714 -2.109208 2.06672
C  -3.380755 0.608809 -0.519148
C  -5.18004 -0.815287 0.690655
C  -5.801394 0.623977 -1.165422
C  -6.540751 -1.186153 0.790799
C  -7.132594 0.189337 -0.993913
H  1.095286 1.469047 -0.599483
H  1.800508 -2.495952 1.096216
H  -0.478062 -1.823037 0.636489
H  5.505337 1.006451 -1.858004
H  5.805567 -0.782048 -1.850331
H  7.070135 0.347587 -1.220772
H  5.264226 2.448953 0.55949
H  3.714888 3.286414 0.986374
H  4.692478 3.864467 -0.417704
H  4.997598 -1.749706 3.01549
H  6.147305 -1.362412 1.670387
H  5.942169 -3.074951 2.23098
H  -2.662159 -1.210667 0.26448
H  -4.467126 -1.214026 1.421567
H  -5.533099 1.358178 -1.930661
H  -6.872416 -1.88736 1.564871
H  -7.932897 0.566503 -1.639727
