program: Gaussian 09
title: 000287826
version: EM64L-G09RevD.01
frameworkgroup: C1[X(C17H14O)]
method: RPBEPBE
basis: SDD
operation: Freq
keyword: #pfreq=noraman
keyword: PBEPBE/SDD
title: #p freq=noraman PBEPBE/SDD
converged: NO YES NO NO
title: Mulliken charges:
elementType: O C C C C C C C C C C C C C C C C C H H H H H H H H H H H H H H
charge: -0.247350 -0.600679 0.358611 -0.514665 0.184796 0.138483 0.078917 -0.442121 -0.396354 -0.332333 -0.234124 -0.253356 0.424338 -0.384573 -0.397868 -0.248972 -0.250102 -0.232504 0.228655 0.229107 0.250976 0.243339 0.238530 0.248541 0.210841 0.229477 0.229692 0.326860 0.224368 0.229768 0.228934 0.230768
chargesum: 0.00000
title: Mulliken charges with hydrogens summed into heavy atoms:
elementType: O C C C C C C C C C C C C C C C C C
charge: -0.247350 -0.142916 0.358611 -0.020350 0.184796 0.138483 0.078917 -0.203591 -0.147813 -0.121492 -0.004647 -0.023664 0.424338 -0.057713 -0.173500 -0.019204 -0.021168 -0.001737
polarizability: 3.42889596e+02 -3.45115655e+00 1.88835924e+02 -6.17463765e-01 -4.85234738e-01 9.53232076e+01
1716.lowfreq: -9.0408 -5.4937 -0.0003 0.0005 0.0007 5.4111 31.5416 46.6910 76.2903
frequency: 31.4892 46.6715 76.2882 106.5500 128.7755 169.3347 188.4023 208.8836 265.5482 306.6421 340.9394 386.8895 403.6528 408.2765 440.7426 474.5234 486.9661 516.6578 528.6583 572.9675 585.8420 616.4078 647.0914 680.5632 698.1942 708.6726 740.6157 761.7184 772.2138 778.1791 812.8312 859.3302 871.9258 889.9737 922.2678 943.3163 950.0945 957.7145 985.5074 986.2886 990.5011 994.1495 1024.9563 1027.6616 1031.8759 1044.1908 1083.3953 1103.8664 1138.5616 1149.6995 1173.0504 1175.7522 1199.8257 1203.9129 1209.9670 1239.9677 1257.1973 1282.0243 1299.6647 1329.7761 1340.6691 1369.4907 1381.1336 1413.5064 1434.7333 1440.0598 1448.1200 1461.8526 1475.6519 1483.4852 1532.2800 1574.3239 1579.8782 1598.1829 1606.9292 1615.2947 2971.5993 2979.7243 3049.7238 3067.6011 3071.3851 3114.4220 3120.0380 3127.2760 3128.9985 3142.2927 3143.7893 3160.5956 3162.4893 3171.2168
redmass: 4.1493 4.3638 5.3171 5.4052 3.2425 3.8900 4.6303 3.3382 6.7268 3.3594 3.4239 4.7937 4.7533 3.1364 3.3471 3.1172 3.5553 4.2612 3.7836 4.2088 3.7564 6.3289 5.3099 5.4898 1.8400 2.9420 3.6287 1.6781 2.0205 2.2927 2.9770 1.2547 1.3661 2.6663 1.3757 2.4756 1.8263 1.5556 1.9556 2.2528 1.3640 2.5362 2.3160 1.3459 2.1551 2.2100 1.9011 1.9586 2.5752 1.2033 1.0838 1.0675 1.5573 1.3103 1.7195 2.0337 3.0918 1.4271 1.4966 1.5383 1.6254 2.7050 6.8452 2.1615 1.1275 2.3417 1.9972 1.1974 2.0247 2.3616 7.6668 5.2951 6.4602 6.5115 5.8842 6.8689 1.0676 1.0631 1.0962 1.0953 1.0853 1.0874 1.0862 1.0885 1.0872 1.0937 1.0933 1.0983 1.1006 1.0978
irintensity: 1.7593 0.6727 0.8907 0.6876 3.0329 1.4059 0.0550 1.7395 2.8998 1.0566 0.1017 0.1731 3.5954 1.9493 1.2766 4.8437 12.7140 6.2741 10.6455 4.4344 17.5413 1.5060 1.1995 2.0825 52.7550 10.0995 5.0968 34.9903 27.7089 55.5913 7.2660 1.6745 1.1284 15.1640 4.6187 5.5879 5.2759 13.6904 1.0683 2.0894 0.5089 3.3126 6.7830 4.6311 17.4007 4.8703 11.4195 21.8064 71.6714 1.9408 1.4401 1.1392 5.4546 15.6790 3.3051 17.1100 18.9717 2.2283 3.9832 4.6339 4.1966 16.3342 5.5973 63.1382 12.1015 28.6825 19.3887 18.7383 7.1311 21.8858 142.0395 4.0929 2.2026 56.6160 1.1516 25.5484 20.9140 20.5018 32.7552 16.4444 17.1633 8.3429 9.2783 3.2854 1.0795 24.6455 33.8481 19.6793 34.7056 58.3872
temp: 298.150 k
press: 1.00000 atm
elementType: 8 6 6 6 6 6 6 6 6 6 6 6 6 6 6 6 6 6 1 1 1 1 1 1 1 1 1 1 1 1 1 1
symmnumber: 1
zpe: 672207.7 jmol-1
zpe.correction: 0.256030 hartree
zpe.thermalcorrener: 0.270226 hartree
zpe.thermalcorrenthalpy: 0.271170 hartree
zpe.thermalcorrgfe: 0.214069 hartree
zpe.sumelectzpe: -730.189963 hartree
zpe.sumelectthermal: -730.175767 hartree
zpe.sumelectthermalent: -730.174823 hartree
zpe.sumelectthermalfe: -730.231924 hartree
dipole: -1.2915 -1.7694 1.0954
dipole: 2.4492
quadrupole: -86.9292 -99.6544 -108.8365
quadrupole: -5.5057 -0.0456 2.9233
quadrupole: 11.5441 -1.1810 -10.3631 -5.5057 -0.0456 2.9233
hfenergy: -730.4459933 hartree
pointgroup: C01 [X(C17H14O1)]
dipole: 0.5470694 0.3664296 0.7035378 debye
polarizability: 341.5810307|-14.7248993|168.0271271|-2.2925942|39.9793009|117.44057 unknown
InChI: InChI=1S/C17H14O/c18-17-11-10-14-8-4-5-9-15(14)16(17)12-13-6-2-1-3-7-13/h1-9,12H,10-11H2
charge 0 multiplicity 1
32 atoms
O  -0.796078 -1.796695 -1.820763
C  2.440776 -2.196367 -0.072371
C  2.795745 -0.734373 0.123026
C  1.497656 -2.335395 -1.285007
C  1.754758 0.230301 -0.035562
C  0.357871 -0.218919 -0.342401
C  0.246721 -1.452493 -1.183785
C  4.104722 -0.311667 0.444238
C  2.075349 1.608774 0.1062
C  -0.692854 0.500644 0.224586
C  4.404756 1.05931 0.610185
C  3.383855 2.021838 0.432671
C  -2.160276 0.455661 0.213648
C  -2.994237 -0.31858 -0.652531
C  -2.804982 1.305333 1.173546
C  -4.397936 -0.251394 -0.539522
C  -4.205608 1.36658 1.282637
C  -5.013132 0.583187 0.422927
H  3.349835 -2.806476 -0.219291
H  1.931851 -2.589963 0.831441
H  1.152856 -3.373401 -1.435173
H  2.035895 -2.038369 -2.20922
H  4.893742 -1.063594 0.566134
H  1.302859 2.364706 -0.075431
H  -0.334882 1.285311 0.910124
H  5.42436 1.374624 0.85749
H  3.610634 3.089266 0.529146
H  -2.521058 -0.955899 -1.402332
H  -2.185588 1.915483 1.843673
H  -5.017752 -0.85181 -1.214872
H  -4.66851 2.022003 2.028479
H  -6.105449 0.629474 0.49851
