program: Gaussian 09
title: 000287824
version: EM64L-G09RevD.01
frameworkgroup: C1[X(C17H13FO2)]
method: RPBEPBE
basis: SDD
operation: Freq
keyword: #p
keyword: freq=noraman
keyword: PBEPBE/SDD
title: #p freq=noraman PBEPBE/SDD
converged: YES YES NO NO
title: Mulliken charges:
elementType: F O O C C C C C C C C C C C C C C C C C H H H H H H H H H H H H H
charge: -0.206524 -0.262013 -0.203389 0.275225 -0.359017 -0.567431 0.024050 -0.572815 0.461192 0.146555 0.376731 -0.298592 -0.368480 -0.346400 -0.401984 -0.247592 -0.223075 -0.386806 -0.377975 0.321194 0.228448 0.232018 0.245538 0.235816 0.236652 0.297619 0.232764 0.283154 0.238788 0.238456 0.233806 0.259099 0.254989
chargesum: 0.00000
title: Mulliken charges with hydrogens summed into heavy atoms:
elementType: F O O C C C C C C C C C C C C C C C C C
charge: -0.206524 -0.262013 -0.203389 0.275225 -0.130569 -0.089875 0.024050 -0.100346 0.461192 0.146555 0.376731 -0.000974 -0.135716 -0.063246 -0.163196 -0.009136 0.010730 -0.127707 -0.122986 0.321194
polarizability: 2.28503553e+02 -9.83490327e-01 1.69164061e+02 1.68087795e+01 -1.38574358e+01 1.56746350e+02
1716.lowfreq: -8.1729 -1.7542 -0.0009 -0.0008 -0.0006 11.1921 23.4739 37.9624 66.6134
frequency: 23.2754 37.7709 66.6059 68.3697 129.2496 143.9550 147.2108 222.6521 242.7642 272.0167 295.7315 302.5698 345.7324 370.5997 390.4694 412.6481 416.3161 436.4835 451.9295 484.5004 502.2979 526.5194 542.1946 555.3222 612.0052 626.0545 658.7609 690.2032 716.7539 736.0603 758.5182 766.0936 785.1757 801.3393 813.4378 824.9109 839.8781 851.2480 888.8929 899.1606 938.8694 945.0120 962.3363 978.4754 987.6641 1006.9861 1007.1361 1034.4220 1038.2277 1052.8685 1094.1733 1106.3474 1138.0635 1156.2285 1173.3165 1175.8192 1198.3585 1203.3244 1213.9526 1220.9582 1242.3257 1268.9424 1297.6425 1315.2403 1324.8811 1342.9577 1363.5286 1387.2936 1394.6425 1415.8637 1440.6193 1454.7730 1473.2797 1477.5628 1497.4473 1567.2116 1585.5221 1599.3072 1613.4166 1616.8300 2964.0160 2999.3009 3041.3254 3043.0978 3063.5077 3122.8992 3126.0978 3139.5473 3152.4459 3168.1518 3169.7809 3175.5206 3191.1465
redmass: 6.9401 4.6424 7.0099 4.2108 5.1675 4.5357 7.5706 3.4247 5.3193 5.0806 3.6718 7.6185 5.4642 7.0206 4.6228 3.3382 4.1782 4.9235 3.7198 3.5473 4.2390 3.0545 7.5346 4.5777 3.9555 6.4640 5.7564 4.5771 3.9237 2.7945 3.4943 2.4618 2.4401 5.2571 1.3921 2.3198 2.0583 4.0307 1.7611 1.7087 1.5312 3.4390 1.3873 1.4016 2.1478 2.1884 1.5387 2.2398 2.0136 1.5082 2.2683 1.3437 1.4963 1.5239 1.2657 1.3867 1.7609 1.9838 1.8488 3.0124 2.0628 1.5063 1.3431 1.4928 2.2818 1.9210 2.7005 6.6198 4.4903 2.5233 2.4082 1.1892 1.1345 2.0145 2.7542 8.9122 7.3902 7.5616 6.2794 7.0189 1.0664 1.0616 1.0935 1.0881 1.1024 1.0873 1.0900 1.0894 1.0936 1.1002 1.0899 1.0953 1.0964
irintensity: 0.2514 1.1907 0.6871 0.0924 3.0656 0.7680 1.4607 1.9671 2.5532 3.4254 0.6787 4.5573 1.6898 0.2437 1.6748 0.4058 1.3494 0.7771 5.8344 4.4708 6.6964 15.3841 24.6997 2.5092 24.0993 3.4249 2.9168 15.8627 1.3238 30.9199 7.1538 18.3888 45.5285 6.6214 16.7527 38.6468 21.7486 59.8985 14.8535 17.2983 6.1697 25.2973 6.2755 3.0991 6.2594 7.8790 3.3360 3.4816 1.6387 3.5910 6.4683 15.0242 8.9636 57.0291 5.5206 3.7457 18.8685 4.1769 33.4634 48.4406 56.4584 12.7881 6.8831 11.9735 67.3088 5.6700 32.5464 4.7431 3.4083 9.4871 19.3530 18.3637 11.8592 10.3272 91.5071 57.9379 53.8232 9.4116 35.0964 26.3653 16.2773 22.6588 37.5657 15.0319 25.4971 5.1047 11.0542 11.8115 9.6188 27.9335 1.9188 3.9770 3.0359
temp: 298.150 k
press: 1.00000 atm
elementType: 9 8 8 6 6 6 6 6 6 6 6 6 6 6 6 6 6 6 6 6 1 1 1 1 1 1 1 1 1 1 1 1 1
symmnumber: 1
zpe: 659886.1 jmol-1
zpe.correction: 0.251337 hartree
zpe.thermalcorrener: 0.267219 hartree
zpe.thermalcorrenthalpy: 0.268163 hartree
zpe.thermalcorrgfe: 0.206925 hartree
zpe.sumelectzpe: -904.476680 hartree
zpe.sumelectthermal: -904.460799 hartree
zpe.sumelectthermalent: -904.459855 hartree
zpe.sumelectthermalfe: -904.521092 hartree
dipole: -4.4829 0.8145 -4.1270
dipole: 6.1475
quadrupole: -112.7044 -112.9604 -112.7170
quadrupole: 5.1979 3.8280 -8.3850
quadrupole: 0.0895 -0.1665 0.0770 5.1979 3.8280 -8.3850
hfenergy: -904.7280175 hartree
pointgroup: C01 [X(C17H13F1O2)]
dipole: 1.8236248 0.2096637 1.5748497 debye
polarizability: 229.6996511|2.2270677|166.0265868|13.3279132|15.4449875|158.6877256 unknown
InChI: InChI=1S/C17H13FO2/c18-13-7-5-12(6-8-13)16-17(20-16)10-9-11-3-1-2-4-14(11)15(17)19/h1-8,16H,9-10H2
charge 0 multiplicity 1
33 atoms
F  -5.075064 -2.128364 0.465979
O  -0.613993 2.489678 -0.927342
O  0.183995 -0.050615 -2.043237
C  0.467665 1.647387 -0.316518
C  -0.910261 1.761699 0.350697
C  1.637563 2.412978 0.287058
C  0.854565 0.384242 -1.062105
C  2.439655 1.483262 1.226087
C  -1.989209 0.730161 0.346935
C  2.076587 -0.321358 -0.557956
C  2.846765 0.192034 0.529562
C  -2.553165 0.239355 -0.859626
C  -2.487741 0.262396 1.591635
C  2.453955 -1.538896 -1.186819
C  3.988078 -0.529998 0.95327
C  3.585508 -2.248924 -0.74903
C  4.356819 -1.739823 0.325907
C  -3.589317 -0.717163 -0.824983
C  -3.516599 -0.70112 1.643659
C  -4.041312 -1.169413 0.426316
H  -0.910288 2.419252 1.235536
H  1.261871 3.297681 0.831864
H  2.289882 2.78047 -0.528471
H  1.818894 1.239506 2.113756
H  3.335868 2.006145 1.606865
H  -2.168672 0.6129 -1.811655
H  -2.071559 0.651794 2.528768
H  1.835851 -1.900789 -2.015072
H  4.593249 -0.138797 1.779947
H  3.871939 -3.187081 -1.235596
H  5.244454 -2.283123 0.668982
H  -4.036976 -1.107463 -1.743169
H  -3.91091 -1.075912 2.592352
