program: Gaussian 09
title: 000287812
version: EM64L-G09RevD.01
frameworkgroup: C1[X(C14H12O3)]
method: RPBEPBE
basis: SDD
operation: Freq
keyword: #pfreq=noraman
keyword: PBEPBE/SDD
title: #p freq=noraman PBEPBE/SDD
converged: YES YES NO NO
title: Mulliken charges:
elementType: O O O C C C C C C C C C C C C C C H H H H H H H H H H H H
charge: -0.272419 -0.266921 -0.224349 -0.280807 -0.227490 0.528632 0.273012 -0.613872 -0.380299 0.368085 0.382866 -0.424122 -0.414978 -0.406491 -0.242123 -0.239450 -0.503051 0.265638 0.267422 0.244151 0.259130 0.238583 0.239727 0.240113 0.230108 0.229785 0.237749 0.247527 0.243846
chargesum: 0.00000
title: Mulliken charges with hydrogens summed into heavy atoms:
elementType: O O O C C C C C C C C C C C C C C
charge: -0.272419 -0.266921 -0.224349 -0.015169 0.039932 0.528632 0.273012 -0.369721 -0.121169 0.368085 0.382866 -0.185539 -0.175251 -0.166378 -0.012015 -0.009666 0.226071
polarizability: 2.69911364e+02 1.41649533e+01 1.48680974e+02 -1.21518072e+01 1.12025541e+01 9.37456003e+01
1716.lowfreq: -0.0007 -0.0007 -0.0006 1.5505 3.8580 9.5751 26.3002 45.0727 56.0143
frequency: 26.2298 45.0336 56.0087 76.6597 87.2561 145.3165 158.7889 179.9875 185.8063 243.7349 270.4696 296.2721 365.4736 374.4256 398.1946 420.2123 480.7930 510.5969 535.7168 553.8215 616.0244 648.6848 656.3111 692.1700 742.3248 755.4037 758.5561 765.5038 787.2673 812.8032 833.1814 861.6611 876.3281 887.2708 916.4988 947.6079 961.2852 968.2644 978.9424 993.7843 1023.4033 1060.0758 1091.2803 1113.5369 1122.7298 1140.8956 1149.6079 1159.9386 1171.3272 1176.7908 1211.6505 1238.9753 1271.7211 1275.7530 1300.2576 1353.2700 1389.7334 1414.3957 1423.7887 1429.0238 1439.2284 1452.4898 1462.2357 1472.2545 1516.8170 1583.3190 1607.7876 1642.0945 1645.1928 3007.0782 3100.2149 3109.8301 3116.0625 3121.0248 3125.3425 3126.9205 3136.3772 3143.5194 3153.1085 3155.0184 3162.7872
redmass: 4.9454 4.7677 5.5631 2.5900 1.3420 4.7264 5.1067 4.3560 4.1068 5.6849 5.6213 5.0617 5.9225 4.1885 4.0174 4.1916 2.4914 6.8463 3.6975 6.4421 6.6192 4.3434 4.5157 5.1463 3.3002 5.8106 2.2242 2.6891 2.6751 6.7662 1.4051 2.6667 2.4145 3.5644 1.7680 4.1587 1.4606 4.1027 1.4007 1.3471 2.2682 1.3099 1.2358 1.2700 1.8924 3.0555 1.4842 1.2224 1.2698 1.4208 1.6650 1.8587 1.5594 1.7831 1.7746 1.8210 2.3302 5.0433 1.2274 4.0682 2.6575 1.0495 1.0516 2.8395 3.7026 7.3258 5.6125 6.9213 9.4717 1.0296 1.0901 1.1047 1.0914 1.0858 1.0887 1.0879 1.0903 1.0949 1.0967 1.1049 1.1004
irintensity: 1.1832 1.7316 0.4994 1.0649 0.3099 1.5264 2.9120 3.9059 0.4160 9.4323 5.1426 13.8312 6.5448 6.5969 0.2745 0.9186 23.9172 0.2314 1.9503 10.8306 0.8963 10.1140 5.1944 7.6752 9.3105 13.6989 20.6356 42.8486 0.3324 32.9349 46.6167 21.9254 4.0590 3.5649 7.1777 10.1517 5.8222 22.6227 6.9829 0.0809 5.9972 5.6788 3.2563 0.0647 51.2581 306.3591 48.3095 1.1527 5.5941 2.6762 6.7622 2.7406 0.5140 7.9629 31.6640 43.9421 75.0948 0.6660 32.6713 2.6472 9.2984 15.6279 12.0337 6.5639 12.8535 0.5601 2.9700 12.5861 154.2043 33.2493 3.1313 23.6747 10.7220 5.2275 3.8377 2.0717 7.4851 31.1304 11.7739 15.0736 35.3658
temp: 298.150 k
press: 1.00000 atm
elementType: 8 8 8 6 6 6 6 6 6 6 6 6 6 6 6 6 6 1 1 1 1 1 1 1 1 1 1 1 1
symmnumber: 1
zpe: 584181.6 jmol-1
zpe.correction: 0.222503 hartree
zpe.thermalcorrener: 0.237328 hartree
zpe.thermalcorrenthalpy: 0.238272 hartree
zpe.thermalcorrgfe: 0.178803 hartree
zpe.sumelectzpe: -765.125339 hartree
zpe.sumelectthermal: -765.110514 hartree
zpe.sumelectthermalent: -765.109570 hartree
zpe.sumelectthermalfe: -765.169038 hartree
dipole: -0.8462 -0.6392 3.1332
dipole: 3.3078
quadrupole: -78.3010 -91.5063 -105.5267
quadrupole: -0.6462 10.4199 2.3339
quadrupole: 13.4770 0.2717 -13.7487 -0.6462 10.4199 2.3339
hfenergy: -765.3478419 hartree
pointgroup: C01 [X(C14H12O3)]
dipole: -0.3411928 -0.8190708 0.9519874 debye
polarizability: 270.2749613|16.8051732|125.5942437|-3.4061038|29.313544|116.4687331 unknown
InChI: InChI=1S/C14H12O3/c1-16-14(15)13-12(17-13)11-7-6-9-4-2-3-5-10(9)8-11/h2-8,12-13H,1H3
charge 0 multiplicity 1
29 atoms
O  2.205791 1.529665 -0.905737
O  4.521049 -0.572428 0.893632
O  4.20618 -0.717051 -1.418542
C  1.385816 0.259931 -0.95703
C  2.539956 0.384328 0.014063
C  -0.033885 0.329173 -0.507635
C  3.818075 -0.343406 -0.289521
C  -0.963162 -0.590522 -1.007683
C  -0.45762 1.323487 0.438637
C  -2.329201 -0.573711 -0.577114
C  -2.749628 0.424353 0.386147
C  -1.781021 1.367296 0.870095
C  -3.294993 -1.511405 -1.072646
C  -4.116991 0.444733 0.815569
C  -4.62082 -1.468436 -0.634973
C  -5.035586 -0.48273 0.317023
C  5.80001 -1.31166 0.744636
H  1.594754 -0.335683 -1.856234
H  2.336249 0.572465 1.073801
H  -0.649367 -1.344014 -1.74191
H  0.269513 2.06706 0.782798
H  -2.101952 2.134104 1.585176
H  -2.977302 -2.26584 -1.802487
H  -4.433233 1.201929 1.543038
H  -5.350907 -2.189392 -1.018694
H  -6.078573 -0.459636 0.651356
H  6.181896 -1.421303 1.768714
H  6.498319 -0.733121 0.117246
H  5.619634 -2.294088 0.276874
