program: Gaussian 09
title: 000287810
version: EM64L-G09RevD.01
frameworkgroup: C1[X(C14H20N2O2)]
method: RPBEPBE
basis: SDD
operation: Freq
keyword: #p
keyword: freq=noraman
keyword: PBEPBE/SDD
title: #p freq=noraman PBEPBE/SDD
converged: YES YES NO NO
title: Mulliken charges:
elementType: O O N N C C C C C C C C C C C C C C H H H H H H H H H H H H H H H H H H H H
charge: -0.253196 -0.433459 -0.123841 -0.061636 -0.174775 -0.361253 -0.363040 -0.164149 -0.387899 -0.381885 0.304561 -0.359960 0.132927 -0.386096 -0.613841 -0.383398 -0.275962 -0.208969 0.239465 0.198406 0.204434 0.229210 0.193513 0.236804 0.182846 0.207533 0.207429 0.181905 0.240762 0.232081 0.241344 0.187427 0.223067 0.222469 0.355380 0.252445 0.229261 0.230089
chargesum: 0.00000
title: Mulliken charges with hydrogens summed into heavy atoms:
elementType: O O N N C C C C C C C C C C C C C C
charge: -0.253196 -0.078078 -0.123841 -0.061636 0.064691 0.041587 0.059683 0.072655 0.002481 0.007449 0.304561 0.112883 0.132927 -0.144751 0.019122 -0.130953 -0.046701 0.021120
polarizability: 1.94775524e+02 -2.11796785e+01 1.66278880e+02 9.90302924e+00 9.72887564e+00 1.37343740e+02
1716.lowfreq: -24.8509 -3.9517 0.0002 0.0004 0.0007 3.7024 26.0374 44.4739 56.3999
frequency: 24.9583 44.4174 56.3387 75.0105 134.1162 141.7559 182.8948 212.1568 220.9367 226.8311 261.0429 271.5783 288.8695 319.6879 320.6378 333.1654 358.2538 397.6177 417.4731 456.8816 483.2241 490.0339 497.6986 523.4251 543.9779 604.5268 635.3273 706.0848 734.6495 754.5061 762.1143 767.1585 805.8368 823.7715 846.2762 850.0166 867.1870 927.9498 933.0600 950.2980 968.6681 980.0247 996.8552 1012.6689 1028.5021 1045.8426 1047.6919 1071.0365 1074.8856 1090.3118 1098.9437 1110.7840 1132.8244 1148.1408 1151.2199 1167.0859 1180.4496 1193.2915 1197.8371 1217.1049 1219.5887 1234.2190 1255.3467 1278.3791 1282.4685 1289.1177 1296.9305 1307.7185 1335.8737 1345.2007 1350.3000 1358.5447 1364.0939 1373.4012 1379.6667 1387.6824 1428.4239 1438.8059 1452.9101 1453.3210 1455.3367 1458.7297 1464.8820 1471.7004 1474.7001 1480.4698 1581.7805 1615.2928 2841.1842 2844.9410 2862.3462 2879.3037 2890.2587 2926.9313 3013.1364 3017.2273 3023.8712 3029.0371 3033.2808 3065.1398 3073.2536 3075.2682 3112.0197 3118.7706 3136.1695 3156.7674 3170.6942 3549.6466
redmass: 3.1360 4.1162 3.8900 4.2771 3.8808 3.2042 3.7593 2.3556 1.4139 2.7314 3.1769 2.0036 1.9497 2.1413 2.6904 2.7947 2.7122 2.0226 3.2997 4.0444 3.0331 3.7644 4.7359 4.5114 4.4111 4.3973 2.4672 4.2006 4.9697 3.4357 1.3390 4.6014 3.1935 3.4317 3.3289 1.5423 1.5460 2.1399 2.8735 1.4100 3.5041 1.3161 2.7213 2.5280 2.2608 2.0688 1.7251 1.7404 1.8485 2.1871 1.8688 1.7897 1.9348 2.6900 3.3379 1.0904 1.8636 1.1259 1.1608 2.4235 1.7445 2.0437 1.4708 1.5133 1.5757 1.5418 1.3653 1.2891 1.2730 1.4677 1.3107 1.4061 1.2967 1.4057 1.6883 4.1418 1.1734 1.8939 1.0814 1.1950 1.1767 1.0732 1.1007 1.1638 2.0330 1.0538 6.8240 6.8018 1.0708 1.0640 1.0621 1.0696 1.0692 1.0834 1.0627 1.0727 1.0888 1.0900 1.0886 1.0896 1.0865 1.1009 1.1027 1.0882 1.0883 1.0941 1.0996 1.0657
irintensity: 0.2744 0.5250 1.1106 1.4130 3.5369 2.3790 9.0577 0.6773 0.6058 2.3874 18.6947 12.4248 6.8331 38.1507 25.7814 13.6327 4.1676 1.1324 6.1919 4.2418 0.4437 3.8683 3.0363 0.2934 3.6607 2.5723 1.3185 5.6765 2.9088 5.0086 91.0581 3.8987 9.6908 24.2341 14.6883 0.1494 1.1909 1.2222 19.9687 6.5814 44.0238 0.1764 48.5183 12.4760 9.5649 67.0441 18.9032 2.1547 3.4008 10.8520 38.9158 33.4776 11.9057 40.7442 23.9498 2.5488 51.0259 4.4181 26.3609 45.1080 22.1600 11.4662 28.5477 10.2915 17.3490 5.8359 19.8978 5.5522 1.7370 11.3064 9.6233 0.0125 30.6775 5.6287 1.7190 11.1077 1.0099 25.1770 0.5210 4.3199 10.0535 30.2405 12.1867 28.9499 47.7092 8.5114 18.8324 20.0661 65.9986 39.7705 167.5895 66.9974 120.6631 48.6066 32.1084 47.4060 44.4957 63.8159 28.4177 21.1521 30.2008 35.5688 18.8480 6.8747 10.1652 19.0745 16.8687 7.8943
temp: 298.150 k
press: 1.00000 atm
elementType: 8 8 7 7 6 6 6 6 6 6 6 6 6 6 6 6 6 6 1 1 1 1 1 1 1 1 1 1 1 1 1 1 1 1 1 1 1 1
symmnumber: 1
zpe: 842290.9 jmol-1
zpe.correction: 0.320812 hartree
zpe.thermalcorrener: 0.337362 hartree
zpe.thermalcorrenthalpy: 0.338306 hartree
zpe.thermalcorrgfe: 0.276430 hartree
zpe.sumelectzpe: -804.019998 hartree
zpe.sumelectthermal: -804.003448 hartree
zpe.sumelectthermalent: -804.002503 hartree
zpe.sumelectthermalfe: -804.064379 hartree
dipole: -1.6438 -1.3499 0.4472
dipole: 2.1736
quadrupole: -102.5558 -109.5261 -109.0589
quadrupole: -8.7327 -0.9935 3.1615
quadrupole: 4.4912 -2.4792 -2.0120 -8.7327 -0.9935 3.1615
hfenergy: -804.3408096 hartree
pointgroup: C01 [X(C14H20N2O2)]
dipole: -0.6401405 0.5408843 -0.1701084 debye
polarizability: 195.3955165|21.2574198|164.9407577|-6.0137538|12.4508162|138.0618707 unknown
InChI: InChI=1S/C14H20N2O2/c1-15-6-8-16(9-7-15)14-11-4-2-3-5-13(11)18-10-12(14)17/h2-5,12,14,17H,6-10H2,1H3
charge 0 multiplicity 1
38 atoms
O  2.186913 -1.03402 -1.461305
O  1.639747 -2.841952 0.862168
N  -1.147495 -0.408048 0.145938
N  -3.833995 0.625906 -0.155832
C  0.181321 -0.805801 0.727604
C  -2.280257 -0.965973 0.92942
C  -1.382629 1.028857 -0.14251
C  0.591601 -2.165327 0.087467
C  -3.599623 -0.801795 0.15787
C  -2.697294 1.183732 -0.925881
C  1.300048 0.204337 0.508623
C  1.001722 -1.928228 -1.370519
C  2.221621 0.05183 -0.564825
C  1.488095 1.29689 1.392379
C  -5.132779 0.854825 -0.815193
C  3.275079 0.977576 -0.763538
C  2.528786 2.228172 1.206556
C  3.422844 2.065094 0.117855
H  0.084193 -0.969024 1.824785
H  -2.376404 -0.454431 1.91899
H  -2.099139 -2.040037 1.120412
H  -0.546999 1.423322 -0.744484
H  -1.453319 1.642211 0.788318
H  -0.261275 -2.86301 0.11272
H  -3.554315 -1.427258 -0.771483
H  -4.437674 -1.1720 0.778425
H  -2.887725 2.258044 -1.109172
H  -2.585654 0.676942 -1.919695
H  1.324303 -2.858335 -1.862349
H  0.155965 -1.465208 -1.912386
H  0.80137 1.407676 2.240778
H  -5.220726 0.350394 -1.811351
H  -5.286632 1.938405 -0.967254
H  -5.948974 0.481703 -0.170419
H  2.485465 -2.332345 0.768299
H  3.959925 0.820419 -1.602643
H  2.650368 3.06587 1.900804
H  4.237945 2.78039 -0.038073
