program: Gaussian 09
title: 000287840
version: EM64L-G09RevD.01
frameworkgroup: C1[X(C22H29NO3)]
method: RPBEPBE
basis: SDD
operation: Freq
keyword: #p
keyword: freq=noraman
keyword: PBEPBE/SDD
title: #p freq=noraman PBEPBE/SDD
converged: YES YES NO NO
title: Mulliken charges:
elementType: O O O N C C C C C C C C C C C C C C C C C C C C C C H H H H H H H H H H H H H H H H H H H H H H H H H H H H H
charge: -0.259035 -0.253058 -0.212437 -0.074070 -0.444059 -0.426691 -0.442292 -0.439573 0.227174 -0.349007 -0.511791 -0.423697 -0.417351 -0.505347 0.021944 0.251510 -0.341582 0.166328 0.386206 -0.603881 0.233853 0.045604 -0.543531 -0.534205 -0.365307 -0.692074 0.232032 0.217532 0.238395 0.207269 0.225068 0.219534 0.224190 0.233379 0.229800 0.231365 0.221100 0.226494 0.208182 0.211691 0.206374 0.214897 0.252439 0.232981 0.250491 0.213541 0.251296 0.265875 0.199732 0.221004 0.203286 0.225711 0.214579 0.208309 0.219825
chargesum: 0.00000
title: Mulliken charges with hydrogens summed into heavy atoms:
elementType: O O O N C C C C C C C C C C C C C C C C C C C C C C
charge: -0.259035 -0.253058 -0.212437 -0.074070 0.005505 0.018972 0.002310 0.017997 0.227174 0.098587 -0.050626 -0.003824 0.003919 -0.019926 0.021944 0.251510 0.122450 0.166328 0.386206 -0.352585 0.233853 0.045604 -0.277656 -0.113469 0.063690 -0.049362
polarizability: 3.46103258e+02 3.83545626e+01 3.01901159e+02 -1.45395893e+01 7.48677961e-02 1.66529030e+02
1716.lowfreq: -6.7296 -6.5047 -3.5313 -0.0007 0.0004 0.0006 18.1401 21.2008 33.5829
frequency: 17.1847 20.7837 33.3117 41.2688 45.6061 46.7271 64.5914 88.8759 93.9687 100.2884 109.3877 116.7601 137.7143 152.3120 203.3747 215.6148 225.4279 241.0027 245.2662 267.2410 268.9895 282.4652 300.6851 327.0050 344.9377 374.3488 387.2260 416.8011 419.6133 433.9108 456.8291 466.5832 500.2935 517.2754 534.1469 564.6513 583.4975 611.4811 627.4605 655.8413 660.9619 678.5181 712.9826 740.7709 742.2075 746.8116 765.0877 768.0286 807.2916 826.0269 826.5548 843.6114 847.9478 856.1388 856.3773 869.2735 880.5664 894.8461 897.1945 910.3614 912.7307 920.6963 935.8710 940.0148 974.6353 983.9193 1021.9613 1037.2240 1049.0301 1049.7098 1075.6045 1077.6752 1080.1720 1083.2881 1094.3888 1100.3907 1102.3876 1129.4423 1135.8204 1151.6958 1160.3674 1172.3102 1176.3364 1193.0374 1203.9458 1218.2660 1227.7355 1231.8463 1241.7922 1246.4292 1257.5764 1265.1077 1268.7322 1278.9517 1287.3345 1288.9168 1290.8402 1299.1867 1304.8146 1313.7927 1318.4626 1328.4857 1335.4835 1336.6065 1343.9123 1356.4357 1373.3517 1384.6675 1389.0280 1391.4528 1428.3206 1450.8136 1457.0374 1465.1880 1465.6611 1466.1834 1470.8259 1472.2135 1475.3192 1475.5644 1478.2717 1480.2560 1483.7533 1486.7614 1489.5880 1497.2326 1556.0921 1602.8373 1615.6318 1654.5693 2907.3923 2959.2828 2970.8918 2971.7132 2979.9540 2981.6518 2984.0926 2986.8745 2987.8199 2998.3839 3004.3213 3006.2506 3017.5900 3022.2518 3028.5809 3037.6300 3044.6864 3045.8455 3050.3363 3053.8584 3055.1143 3068.3897 3072.0391 3074.2902 3075.9326 3091.9107 3109.6772 3143.6231 3181.0902
redmass: 4.6387 4.2247 3.4416 3.4677 2.3970 3.2587 3.3437 1.9522 2.2044 2.9582 3.1108 5.9055 3.1487 3.5695 2.6884 2.8678 4.7648 1.6571 1.8936 3.5617 3.4549 2.7855 3.5752 3.2149 2.9439 3.2961 3.0055 3.8874 2.9418 3.6597 3.5355 3.7876 4.3103 3.2169 5.2033 5.1551 3.3287 2.4030 3.9411 3.7663 5.2500 7.7388 5.2465 3.1030 3.3467 1.2059 1.5883 3.3541 1.2875 1.5834 2.0677 1.8243 3.2906 2.1375 2.0875 1.3670 3.4328 2.1810 1.5396 2.5555 1.5473 3.4395 1.6468 4.0342 3.2017 3.3067 2.8587 2.7165 2.9551 2.5048 2.0520 1.6689 2.0156 1.8513 2.1297 1.8544 3.5070 2.3296 1.1978 2.2322 1.8992 1.2723 1.6862 1.2694 2.7796 1.2352 1.4427 2.2622 1.5082 1.2937 1.3330 1.3318 1.2624 1.3556 1.3118 1.1469 1.1321 1.2749 1.6401 1.3167 1.5482 1.3531 1.4499 1.4598 1.4548 1.5801 1.5450 2.7116 1.2332 5.3716 4.2719 1.2010 1.0919 1.1046 1.1040 1.0925 1.0895 1.0816 1.0778 1.0771 1.0469 1.0868 1.0892 1.0865 1.0945 3.2767 8.7042 7.4298 7.6886 11.2758 1.0687 1.0637 1.0675 1.0357 1.0592 1.0662 1.0606 1.0655 1.0622 1.0620 1.0655 1.0600 1.0933 1.0641 1.0973 1.0929 1.0903 1.0982 1.1024 1.1036 1.1019 1.1015 1.0996 1.1017 1.1021 1.1061 1.1011 1.0902 1.0911
irintensity: 1.5051 0.6814 0.4063 0.0985 0.0388 0.5050 0.1773 0.1094 0.1510 1.7498 0.7433 0.8406 0.2903 0.3955 1.9591 0.7127 0.7574 1.3482 0.4966 2.3960 1.7948 5.2948 0.7303 1.2462 5.0759 2.5314 2.0641 1.6509 6.3182 9.4322 4.7640 5.8405 9.4115 1.6174 7.6101 2.4961 4.7522 4.1001 1.0815 5.6426 3.2178 6.6664 4.0991 0.6520 0.5928 4.6657 16.6897 1.0275 1.8988 8.4292 5.9668 21.9546 39.0860 14.1060 9.7472 8.9660 12.8059 8.0082 2.6125 5.9670 2.5096 44.6646 4.9564 47.6592 29.9671 69.0011 19.3461 17.2256 4.0262 12.6356 54.7934 18.3424 12.9466 1.7703 19.7914 4.6866 75.1092 112.8461 8.2711 24.4593 8.3360 2.5130 7.3798 2.8262 9.8736 4.1524 1.9656 39.5680 37.5911 18.4908 12.7994 34.0870 6.6343 0.8786 5.0886 3.8987 9.6767 2.3492 57.0157 6.8212 5.7324 4.8330 0.3604 12.0379 4.4200 1.3301 36.6024 58.7347 14.6796 26.3843 6.4554 15.6820 12.5009 3.0015 4.8579 2.8980 9.9550 10.9277 3.8503 6.2434 17.4092 13.8164 6.8281 15.5479 7.2342 78.0417 80.2137 10.8540 397.4350 379.8263 68.2799 20.0842 17.4821 44.0800 9.9510 39.1077 33.1036 62.2347 56.9696 21.7909 32.6276 55.2580 26.4216 38.1247 1.5493 13.1855 10.5187 68.4689 2.3425 56.5579 30.5052 3.5351 53.7708 67.3016 17.9403 113.0817 27.0555 10.4766 3.5897
temp: 298.150 k
press: 1.00000 atm
elementType: 8 8 8 7 6 6 6 6 6 6 6 6 6 6 6 6 6 6 6 6 6 6 6 6 6 6 1 1 1 1 1 1 1 1 1 1 1 1 1 1 1 1 1 1 1 1 1 1 1 1 1 1 1 1 1
symmnumber: 1
zpe: 1225560.8 jmol-1
zpe.correction: 0.466791 hartree
zpe.thermalcorrener: 0.491898 hartree
zpe.thermalcorrenthalpy: 0.492842 hartree
zpe.thermalcorrgfe: 0.409023 hartree
zpe.sumelectzpe: -1134.202532 hartree
zpe.sumelectthermal: -1134.177426 hartree
zpe.sumelectthermalent: -1134.176482 hartree
zpe.sumelectthermalfe: -1134.260301 hartree
dipole: 0.7803 4.0307 1.3874
dipole: 4.3336
quadrupole: -131.6412 -170.2389 -156.5889
quadrupole: -17.5867 1.6574 -0.4247
quadrupole: 21.1818 -17.4159 -3.7659 -17.5867 1.6574 -0.4247
hfenergy: -1134.6693235 hartree
pointgroup: C01 [X(C22H29N1O3)]
dipole: -0.6299996 1.207941 1.0251125 debye
polarizability: 345.4989614|22.3261238|209.4169388|-50.7486482|51.2573357|259.6175473 unknown
InChI: InChI=1S/C22H29NO3/c1-2-7-16-14-19-17-8-3-4-9-18(17)22(24)26-21(19)15-20(16)25-13-12-23-10-5-6-11-23/h14-15H,2-13H2,1H3
charge 0 multiplicity 1
55 atoms
O  -2.286567 -0.2537 1.527065
O  1.316814 -0.885374 -1.674151
O  2.99021 -1.248444 -3.206341
N  -4.764173 -1.71207 -0.937979
C  -5.981706 -1.200072 -1.631601
C  -4.081326 -2.525355 -1.992689
C  -5.522936 -0.816444 -3.073824
C  -4.364069 -1.821964 -3.373104
C  2.986555 0.972421 -0.289443
C  -3.902739 -0.659587 -0.341031
C  3.843302 1.979812 0.465622
C  5.112669 2.41467 -0.299557
C  5.815489 1.194367 -0.92929
C  4.883423 0.517741 -1.954801
C  3.476633 0.317344 -1.41408
C  1.638215 0.687144 0.189842
C  -3.135841 -1.262119 0.854377
C  0.839942 -0.2487 -0.524104
C  -0.250538 0.975234 1.784558
C  1.048547 1.277244 1.348052
C  -1.010453 0.021621 1.025499
C  2.654687 -0.632175 -2.17132
C  -0.466881 -0.586773 -0.124741
C  -0.85663 1.646503 3.003928
C  -1.837657 2.79668 2.637712
C  -2.446889 3.462139 3.889593
H  -6.432955 -0.365883 -1.068478
H  -6.725219 -2.019559 -1.678293
H  -4.511683 -3.54377 -1.989599
H  -3.002709 -2.619184 -1.775633
H  -5.148698 0.223399 -3.08869
H  -6.345228 -0.887379 -3.806922
H  -4.65832 -2.566111 -4.133807
H  -3.469196 -1.300131 -3.753601
H  3.23185 2.87022 0.709182
H  4.128335 1.53278 1.441575
H  -4.544873 0.15472 0.040272
H  -3.189833 -0.202183 -1.066234
H  4.836763 3.126638 -1.102863
H  5.792402 2.951222 0.388406
H  6.082539 0.472191 -0.131997
H  6.757793 1.498438 -1.421583
H  5.283405 -0.461542 -2.276488
H  4.830703 1.127486 -2.880467
H  -3.85262 -1.582497 1.625858
H  -2.529149 -2.138169 0.555022
H  1.630393 1.994737 1.936432
H  -1.014119 -1.313505 -0.728578
H  -0.047889 2.054924 3.640836
H  -1.408862 0.90138 3.607175
H  -1.300616 3.552561 2.031171
H  -2.64307 2.386233 2.000181
H  -3.015367 2.72776 4.49063
H  -1.658813 3.889408 4.538653
H  -3.137242 4.280274 3.613847
