program: Gaussian 09
title: 000287703
version: EM64L-G09RevD.01
frameworkgroup: C1[X(C11H14N4O5)]
method: RPBEPBE
basis: SDD
operation: Freq
keyword: #p
keyword: freq=noraman
keyword: PBEPBE/SDD
title: #p freq=noraman PBEPBE/SDD
converged: YES YES NO NO
title: Mulliken charges:
elementType: O O O O O N N N N C C C C C C C C C C C H H H H H H H H H H H H H H
charge: -0.316530 -0.444081 -0.419172 -0.517852 -0.205681 -0.184912 -0.012553 -0.349118 -0.007457 -0.164348 -0.193260 -0.185465 -0.103278 0.333072 -0.311930 0.052596 -0.108808 -0.634428 0.012052 -0.270695 0.263745 0.282493 0.278787 0.264972 0.219286 0.231184 0.375784 0.352041 0.278216 0.268811 0.248312 0.347275 0.385427 0.235515
chargesum: 0.00000
title: Mulliken charges with hydrogens summed into heavy atoms:
elementType: O O O O O N N N N C C C C C C C C C C C
charge: -0.316530 -0.068297 -0.067131 -0.132425 -0.205681 -0.184912 -0.012553 -0.001844 -0.007457 0.099397 0.089233 0.093322 0.161694 0.333072 0.138540 0.052596 -0.108808 0.160911 0.012052 -0.035179
polarizability: 2.18272177e+02 -2.65806126e+00 1.69873547e+02 1.21332855e+01 1.71217054e+00 1.00800572e+02
1716.lowfreq: -12.3452 -5.6778 -0.0005 -0.0004 -0.0004 5.9476 25.9630 33.4726 59.5200
frequency: 25.9505 33.3660 59.4020 74.1518 82.2810 94.1491 117.7832 154.3037 167.9396 185.4662 215.5359 237.4604 239.3381 256.9084 278.9065 293.8395 306.5554 328.0310 345.9658 358.7399 400.0032 424.4639 462.4003 479.1233 504.3301 558.1471 587.8895 597.3230 610.2327 625.6526 641.1378 670.1786 693.5107 712.6304 762.5442 770.7194 786.3379 816.3360 843.1921 867.7833 905.3541 907.8652 914.5337 934.4398 943.6949 986.7575 997.2118 1017.7444 1024.5680 1028.0985 1063.0288 1069.8436 1072.0643 1122.3221 1146.7783 1161.4390 1193.1602 1209.9704 1227.7853 1236.2049 1241.4734 1260.4517 1270.5673 1287.1370 1303.9238 1332.9847 1341.0592 1346.3987 1362.2974 1375.5357 1392.8484 1396.2598 1426.7383 1453.2228 1455.5880 1467.3001 1470.7721 1474.2620 1495.0604 1543.4296 1610.5961 1635.5644 2974.1740 2987.7724 3001.0687 3044.3208 3044.3475 3079.7778 3094.9210 3104.1932 3119.6642 3137.2496 3270.7822 3527.7213 3535.2503 3615.2339
redmass: 6.5778 4.6849 6.4072 1.2472 4.5706 4.4976 4.9386 5.1378 4.1983 5.4407 3.0712 3.1729 1.3883 5.2812 5.3725 6.9843 5.0096 1.8594 2.1786 3.6411 4.1598 5.7148 8.1765 5.3817 3.9692 6.8060 5.2555 4.7908 7.6345 9.2161 6.8142 4.2847 1.2980 1.1019 5.5030 6.0912 10.8542 4.4532 5.7857 4.0743 3.8042 1.5372 5.1364 3.9592 2.9611 4.3011 5.7121 3.5561 4.2448 2.9186 4.3169 2.5295 1.7194 1.3258 1.1968 2.2802 1.2634 1.2362 1.1441 1.9092 1.7270 2.9190 1.4861 1.3954 1.5449 1.5091 1.5382 2.3192 1.5888 1.3294 1.7483 2.0040 3.0460 1.3910 1.1364 1.1509 1.0775 2.2962 1.3174 6.9479 11.3597 9.3095 1.0581 1.0844 1.0371 1.1015 1.0904 1.0877 1.0989 1.0882 1.0921 1.1020 1.0660 1.0792 1.0665 1.0670
irintensity: 1.3678 0.5119 4.4088 1.4316 1.1887 1.5471 0.3482 1.4886 10.8116 8.2940 42.5320 10.1108 113.9735 0.2667 6.1674 9.2469 1.8091 33.3600 65.1691 3.5953 16.6295 5.2163 1.5096 1.8240 7.1729 3.4965 2.6001 9.0476 4.3941 8.9808 17.7580 7.9893 72.8722 142.4445 38.2593 0.2638 1.5182 20.3408 13.9683 13.4751 7.2917 4.9144 60.7259 13.7398 0.4666 70.3270 91.2854 20.9863 60.5485 55.0714 78.7284 1.5676 2.0647 7.8309 27.5927 31.0037 20.8006 11.7641 24.3106 11.2425 1.2489 13.4369 5.1950 26.4383 4.3332 8.3148 12.3667 3.7025 11.2700 15.0167 83.3291 133.0510 60.3815 2.8100 43.3704 43.4425 11.1844 18.7154 20.5317 233.8986 276.3086 65.6779 48.9988 17.5971 33.0008 20.7338 25.8368 21.8430 9.1722 12.4254 23.6656 1.3968 289.3232 95.5728 15.9499 22.8228
temp: 298.150 k
press: 1.00000 atm
elementType: 8 8 8 8 8 7 7 7 7 6 6 6 6 6 6 6 6 6 6 6 1 1 1 1 1 1 1 1 1 1 1 1 1 1
symmnumber: 1
zpe: 677761.2 jmol-1
zpe.correction: 0.258146 hartree
zpe.thermalcorrener: 0.276677 hartree
zpe.thermalcorrenthalpy: 0.277621 hartree
zpe.thermalcorrgfe: 0.210711 hartree
zpe.sumelectzpe: -1021.142539 hartree
zpe.sumelectthermal: -1021.124008 hartree
zpe.sumelectthermalent: -1021.123064 hartree
zpe.sumelectthermalfe: -1021.189974 hartree
dipole: -13.4817 -2.7634 -4.2647
dipole: 14.4077
quadrupole: -150.2176 -106.4456 -117.5878
quadrupole: 7.0896 11.9603 0.8957
quadrupole: -25.4673 18.3048 7.1625 7.0896 11.9603 0.8957
hfenergy: -1021.4006848 hartree
pointgroup: C01 [X(C11H14N4O5)]
dipole: -5.2775019 -0.0095251 2.0685486 debye
polarizability: 215.2201892|12.368933|166.6948864|-16.6736257|16.588395|107.0312205 unknown
InChI: InChI=1S/C11H14N4O5/c1-15-7(5-6(14-15)11(19)13-3-12-5)10-9(18)8(17)4(2-16)20-10/h3-4,8-10,12,16-18H,2H2,1H3
charge 0 multiplicity 1
34 atoms
O  -1.467951 0.700143 0.937232
O  -2.881402 -1.966896 -0.80821
O  -2.048174 1.464335 -1.972982
O  -4.134282 -0.757404 1.22301
O  4.947044 0.394991 -0.530735
N  1.119286 -1.670084 -0.398328
N  2.466604 -1.387102 -0.577031
N  1.219673 1.749727 0.718314
N  3.584556 2.102081 0.355581
C  -1.100008 -0.629126 0.35178
C  -2.000839 -0.822079 -0.93224
C  -2.747593 0.541468 -1.070908
C  -2.779116 1.115434 0.365007
C  0.379395 -0.594034 0.096237
C  -3.954533 0.709218 1.259204
C  1.317059 0.439936 0.249565
C  2.585189 -0.077638 -0.177937
C  0.652935 -3.042735 -0.636002
C  3.804159 0.765108 -0.155519
C  2.389145 2.502677 0.74989
H  -1.377802 -1.420808 1.075322
H  -1.404387 -1.001978 -1.840105
H  -3.7410 0.40476 -1.523062
H  -2.76199 2.21973 0.323788
H  -4.87467 1.212093 0.896751
H  -3.738372 1.034307 2.294929
H  -3.513831 -1.758327 -0.052562
H  -1.097594 1.539469 -1.69644
H  -0.408021 -3.046135 -0.93187
H  1.267249 -3.475194 -1.439007
H  0.775243 -3.655009 0.275405
H  0.324259 2.080091 1.086496
H  -4.746016 -1.055685 1.93714
H  2.274488 3.521063 1.142689
