program: Gaussian 09
title: 000287651
version: EM64L-G09RevD.01
frameworkgroup: C1[X(C21H20O3)]
method: RPBEPBE
basis: SDD
operation: Freq
keyword: #pfreq=noraman
keyword: PBEPBE/SDD
title: #p freq=noraman PBEPBE/SDD
converged: YES YES NO NO
title: Mulliken charges:
elementType: O O O C C C C C C C C C C C C C C C C C C C C C H H H H H H H H H H H H H H H H H H H H
charge: -0.174657 -0.282389 -0.272476 0.056941 0.210636 -0.513578 -0.570594 0.068426 0.195814 0.133780 0.034665 -0.602091 -0.757005 0.187111 -0.396064 0.418217 0.151349 -0.524180 -0.376265 -0.437120 -0.263857 -0.244365 -0.253611 -0.667164 0.250374 0.232872 0.238871 0.237125 0.281653 0.267095 0.246946 0.246010 0.228205 0.308929 0.239195 0.248833 0.244546 0.227928 0.230450 0.221931 0.234413 0.217543 0.249854 0.225704
chargesum: 0.00000
title: Mulliken charges with hydrogens summed into heavy atoms:
elementType: O O O C C C C C C C C C C C C C C C C C C C C C
charge: -0.174657 -0.282389 -0.272476 0.056941 0.210636 -0.030331 -0.094598 0.068426 0.195814 0.133780 0.034665 -0.053343 -0.035844 0.187111 -0.087135 0.418217 0.151349 -0.284985 -0.127432 -0.192574 -0.035928 -0.013915 0.202733 0.025936
polarizability: 4.07070430e+02 -4.94648319e+00 2.47068475e+02 -2.26963290e+00 -1.11489440e+01 1.30845730e+02
1716.lowfreq: -6.9398 -6.1811 -3.4431 0.0001 0.0003 0.0006 21.9503 30.4321 46.6005
frequency: 21.8069 30.4167 46.5841 62.0352 73.5773 104.7596 113.6616 124.4945 149.9643 166.8989 183.1092 214.9599 219.5169 234.1661 240.8671 259.6563 269.9955 279.2239 314.7538 327.5352 344.4891 369.3606 407.0844 411.9768 431.4946 442.5726 470.8040 503.0324 521.3850 538.6501 554.3513 565.6705 588.5980 615.0012 636.9393 645.4313 688.1633 696.2923 718.5807 737.5247 754.5436 766.5369 788.5396 798.8269 818.1318 839.6627 843.2084 843.8700 879.7806 891.5167 905.1775 912.1136 947.8923 961.2569 969.2794 982.4128 991.2958 1000.8255 1017.2307 1026.3433 1034.0380 1057.5662 1075.6732 1093.2467 1095.7530 1100.2432 1136.1716 1152.3896 1157.3072 1172.2316 1176.0279 1181.9644 1207.0532 1221.5193 1236.0239 1241.0732 1246.2214 1268.5178 1275.6206 1279.5786 1307.8931 1326.5401 1347.2333 1356.1899 1374.3708 1379.0582 1390.2719 1404.0323 1409.1843 1416.4187 1431.1525 1448.8844 1455.8380 1462.1669 1464.4671 1466.4592 1475.1778 1485.4114 1486.7135 1515.1189 1556.0090 1566.3941 1594.3095 1607.6176 1627.9708 1665.2841 2966.8477 2985.9741 2990.5620 2990.9564 2992.4300 3020.4813 3029.4789 3045.5710 3060.0636 3083.4995 3086.9136 3092.5445 3095.1398 3117.8998 3123.2616 3131.2319 3134.9485 3152.9588 3167.1747 3181.8674
redmass: 4.3613 4.7113 4.3687 4.1554 4.5302 3.5840 3.6355 3.4836 3.8469 3.9340 2.5052 1.4028 3.1133 1.3962 4.7264 2.1508 2.5245 3.7516 3.6251 3.4272 3.6177 3.5879 7.2233 3.0740 3.7506 4.7694 4.2817 3.5575 4.3254 3.1699 3.3400 4.6403 5.0403 4.0151 4.4706 4.1881 5.0228 4.5980 3.6813 2.8475 2.2862 1.7246 2.6421 2.8188 1.6235 4.0197 2.8467 1.7794 1.9004 2.0077 2.5501 2.6561 2.2478 1.4800 2.2647 2.9136 1.3803 1.3991 2.6177 2.3576 2.1601 2.7195 2.4895 2.4206 2.1669 2.1801 1.5307 1.7305 1.4991 2.1096 2.2610 1.5131 1.6839 1.4745 2.2207 2.0502 2.0297 1.7534 2.2875 1.1218 2.3132 1.7059 1.5036 1.3514 1.9297 1.4482 1.2328 4.2181 2.8029 1.1151 4.1197 1.4162 1.1017 1.0763 1.0445 1.3120 1.1520 1.0512 1.0808 3.2410 7.3590 8.6450 8.3075 6.2904 6.5258 12.1898 1.0633 1.0346 1.0654 1.0640 1.0361 1.0930 1.0589 1.0935 1.1018 1.1001 1.0977 1.1032 1.1007 1.1058 1.0861 1.0905 1.0892 1.0946 1.0990 1.0949
irintensity: 1.4076 0.5183 0.3802 0.2707 2.4306 2.4269 7.0071 0.3065 1.4091 0.2109 0.5718 0.6231 2.0827 4.0493 2.3114 1.2766 0.9842 1.4044 1.2207 24.0372 9.4440 1.1884 2.7052 6.1101 2.3485 3.3879 0.7774 0.5783 2.9606 5.8484 0.2921 2.3537 1.9854 1.1947 2.6416 5.5540 6.1629 8.5880 4.4666 0.2565 27.5080 49.4730 10.0779 1.5318 1.4816 2.3322 12.3643 32.5237 10.5232 12.1063 14.9092 1.6871 34.1512 3.4764 13.4395 1.5293 0.8704 8.8025 97.5173 21.8177 24.4726 240.2744 3.0737 116.2847 12.1211 26.8815 31.0331 152.8360 10.3307 19.6196 291.0042 62.7172 5.1287 2.0194 9.9128 1.7706 5.9887 11.3909 1.8693 2.8225 6.2861 0.1052 0.1749 0.2140 12.0897 22.8336 27.8358 1.5726 0.9593 9.5776 0.6961 10.5966 15.5270 8.8486 13.3348 3.3449 4.9967 12.5598 9.6350 4.6717 65.0905 246.8269 103.8532 30.7336 2.7266 190.0611 19.1106 22.0756 7.6476 19.3563 26.9332 25.0772 39.7989 1.5848 22.5248 16.5113 38.1436 2.9221 16.6843 36.0483 0.7926 8.3315 14.3571 33.3663 34.8681 45.7238
temp: 298.150 k
press: 1.00000 atm
elementType: 8 8 8 6 6 6 6 6 6 6 6 6 6 6 6 6 6 6 6 6 6 6 6 6 1 1 1 1 1 1 1 1 1 1 1 1 1 1 1 1 1 1 1 1
symmnumber: 1
zpe: 927955.4 jmol-1
zpe.correction: 0.353440 hartree
zpe.thermalcorrener: 0.374526 hartree
zpe.thermalcorrenthalpy: 0.375470 hartree
zpe.thermalcorrgfe: 0.302950 hartree
zpe.sumelectzpe: -1036.221075 hartree
zpe.sumelectthermal: -1036.199988 hartree
zpe.sumelectthermalent: -1036.199044 hartree
zpe.sumelectthermalfe: -1036.271564 hartree
dipole: 1.0188 -1.3724 0.1624
dipole: 1.7169
quadrupole: -117.8702 -146.9669 -140.3058
quadrupole: 13.9904 -0.7712 -0.3390
quadrupole: 17.1774 -11.9192 -5.2582 13.9904 -0.7712 -0.3390
hfenergy: -1036.5745144 hartree
pointgroup: C01 [X(C21H20O3)]
dipole: 0.434933 0.509448 -0.0869069 debye
polarizability: 407.0047036|-5.9703892|246.2614668|-2.2524567|-14.9812571|131.7184638 unknown
InChI: InChI=1S/C21H20O3/c1-3-24-20(23)17-12-18(22)21(2)11-10-15-14-7-5-4-6-13(14)8-9-16(15)19(17)21/h4-9H,3,10-12H2,1-2H3
charge 0 multiplicity 1
44 atoms
O  -2.715029 -3.655218 0.223139
O  -4.074477 1.235315 0.593405
O  -2.162064 2.412059 -0.01503
C  -0.86804 -2.058239 -0.211973
C  -0.884054 -0.527026 -0.116221
C  0.109368 -2.616897 0.849883
C  1.534763 -2.092442 0.594408
C  -2.322879 -2.474288 0.067691
C  0.439072 0.135875 -0.136358
C  1.603365 -0.625746 0.172587
C  -2.191827 -0.06953 0.030487
C  -3.189091 -1.22177 0.108673
C  -0.506051 -2.550973 -1.646681
C  2.908089 -0.007966 0.089272
C  0.587569 1.521226 -0.512514
C  3.027872 1.383421 -0.296972
C  -2.726349 1.301761 0.181557
C  1.836209 2.121033 -0.59084
C  4.11997 -0.730654 0.370112
C  4.322327 1.991038 -0.380319
C  5.371178 -0.115732 0.278319
C  5.477593 1.259472 -0.097931
C  -4.778129 2.541569 0.763231
C  -5.371721 3.015705 -0.566701
H  0.088095 -3.721599 0.8323
H  -0.2328 -2.297774 1.853368
H  2.026664 -2.708841 -0.185966
H  2.135346 -2.240595 1.512068
H  -3.805549 -1.190808 1.025581
H  -3.915756 -1.225009 -0.728146
H  0.508717 -2.228624 -1.934649
H  -0.55958 -3.653797 -1.678029
H  -1.210615 -2.146346 -2.395435
H  -0.312364 2.100746 -0.722573
H  1.920295 3.174215 -0.883272
H  4.071192 -1.785052 0.657113
H  4.389131 3.045815 -0.672129
H  6.279095 -0.688995 0.496138
H  6.463811 1.731837 -0.163803
H  -5.559051 2.318883 1.508303
H  -4.062286 3.278542 1.167168
H  -5.965695 3.934121 -0.402716
H  -4.573585 3.2472 -1.291557
H  -6.03713 2.247485 -0.997385
