program: Gaussian 09
title: 000287628
version: EM64L-G09RevD.01
frameworkgroup: C1[X(C17H15NO2)]
method: RPBEPBE
basis: SDD
operation: Freq
keyword: #p
keyword: freq=noraman
keyword: PBEPBE/SDD
title: #p freq=noraman PBEPBE/SDD
converged: YES YES NO NO
title: Mulliken charges:
elementType: O O N C C C C C C C C C C C C C C C C C H H H H H H H H H H H H H H H
charge: -0.195627 -0.257895 -0.006195 0.178367 -0.486410 -0.556244 0.249376 0.118761 0.021737 0.200493 -0.724803 0.462573 -0.401702 -0.474349 -0.210308 -0.380775 -0.581380 -0.384859 0.329046 -0.535898 0.227671 0.231360 0.228529 0.262441 0.260850 0.222702 0.223767 0.279855 0.245953 0.239322 0.268347 0.245690 0.225074 0.251010 0.223523
chargesum: 0.00000
title: Mulliken charges with hydrogens summed into heavy atoms:
elementType: O O N C C C C C C C C C C C C C C C C C
charge: -0.195627 -0.257895 -0.006195 0.178367 -0.027379 -0.065274 0.249376 0.118761 0.021737 0.200493 -0.017484 0.462573 -0.121847 -0.228397 -0.210308 -0.141453 -0.313034 -0.139169 0.329046 0.163709
polarizability: 3.34221179e+02 -2.20524688e+01 1.86937643e+02 3.48235870e+00 2.49984486e+00 1.16649846e+02
1716.lowfreq: -7.9855 0.0002 0.0006 0.0008 1.0963 6.7842 32.5502 51.4808 75.4230
frequency: 32.5377 51.4796 75.4193 96.4601 119.2211 136.1800 149.0546 183.6325 193.3187 210.3818 231.3513 238.1304 256.0044 268.1429 295.3299 309.2472 342.3763 374.8684 393.5328 421.5833 437.0562 473.0345 503.6145 520.4758 523.7425 552.6049 563.3777 569.4817 591.5580 634.8014 652.9022 706.8649 732.2492 746.2629 786.3533 791.0093 818.1745 839.9490 863.8751 886.4730 901.7252 908.5007 917.5064 951.8409 958.2944 1000.3861 1001.8039 1006.3141 1044.4242 1078.0775 1110.3372 1122.1800 1126.3699 1144.1151 1163.2655 1168.8908 1181.1231 1203.0479 1221.2768 1232.8259 1257.5113 1270.8991 1281.4225 1318.1926 1344.1281 1370.9251 1388.1454 1391.6929 1423.7304 1435.3575 1437.2184 1453.2260 1460.4926 1466.7048 1469.2149 1469.4653 1473.7149 1474.4611 1511.5689 1563.2497 1585.1957 1608.7808 1634.8903 2174.1035 2965.5543 2966.6237 2994.4343 3001.1619 3034.2798 3056.9138 3060.0789 3098.6962 3121.8649 3130.3312 3135.4563 3147.0295 3156.5601 3164.6216 3170.6048
redmass: 5.5177 5.5562 4.5941 4.5102 7.7991 3.9353 4.0817 2.4977 1.2980 1.8760 1.7135 2.6966 2.8131 5.6240 3.5401 3.1669 4.3126 5.6971 5.9534 3.0013 4.7063 5.9745 4.5491 4.1379 4.1403 4.7811 5.5470 4.4705 4.7618 4.4398 3.5068 6.2584 3.7988 3.1397 2.5833 2.8298 2.1888 1.5271 3.9222 2.3152 4.3036 1.7543 2.0029 1.4268 3.8302 2.3578 1.4064 2.2424 1.9351 2.7553 1.2565 1.7608 2.8232 1.4431 1.7264 2.1546 1.5108 1.7281 1.6773 1.6110 1.7940 2.7827 2.2368 1.5186 1.6073 2.1707 3.3386 1.1987 3.1445 4.0638 1.6444 1.2215 1.0685 1.4720 1.0694 1.0740 1.0570 1.3632 3.6301 8.1925 9.9189 6.6438 6.8193 12.6436 1.0328 1.0651 1.0611 1.0362 1.0933 1.1044 1.1031 1.1007 1.1001 1.0996 1.0886 1.0867 1.0921 1.0964 1.0958
irintensity: 2.0401 0.5421 0.9827 9.7251 2.6071 0.1503 1.0985 0.3942 0.0125 1.7550 0.9984 4.5297 5.4823 3.5627 9.0259 3.1589 1.7359 3.8540 3.2611 5.0450 0.7069 1.0262 1.8383 4.7510 9.9497 5.6424 9.7812 12.6877 4.5800 3.6820 2.7028 1.2951 0.5248 11.8450 7.9951 14.3219 24.8918 9.4919 6.2866 10.9098 10.4955 59.7026 8.7461 3.5307 24.8297 45.0529 8.6057 39.9341 10.9615 3.4244 0.1604 3.5995 4.9941 6.4388 139.8653 32.1907 41.9690 46.8032 28.9175 160.4734 57.6441 78.4327 38.1318 15.9966 18.0816 20.7089 27.9739 28.6717 16.3662 59.7485 5.5877 53.6615 3.9737 152.7054 12.0376 20.8468 15.7472 1.0770 18.0622 121.7072 302.1995 2.5447 199.6133 16.4021 82.7474 9.8163 18.7516 29.0587 22.6141 43.8606 23.7548 23.6135 7.3187 24.8726 6.1215 4.9489 3.4765 10.9614 14.8936
temp: 298.150 k
press: 1.00000 atm
elementType: 8 8 7 6 6 6 6 6 6 6 6 6 6 6 6 6 6 6 6 6 1 1 1 1 1 1 1 1 1 1 1 1 1 1 1
symmnumber: 1
zpe: 720647.9 jmol-1
zpe.correction: 0.274480 hartree
zpe.thermalcorrener: 0.291991 hartree
zpe.thermalcorrenthalpy: 0.292936 hartree
zpe.thermalcorrgfe: 0.229449 hartree
zpe.sumelectzpe: -860.594387 hartree
zpe.sumelectthermal: -860.576876 hartree
zpe.sumelectthermalent: -860.575932 hartree
zpe.sumelectthermalfe: -860.639419 hartree
dipole: 5.1415 -3.3449 -3.7703
dipole: 7.1999
quadrupole: -105.3741 -111.8745 -127.1755
quadrupole: -4.3332 13.1186 7.9943
quadrupole: 9.4340 2.9335 -12.3675 -4.3332 13.1186 7.9943
hfenergy: -860.8688674 hartree
pointgroup: C01 [X(C17H15N1O2)]
dipole: -2.0380814 1.3052628 -1.4718957 debye
polarizability: 332.9075606|-25.3394832|187.664107|-8.8639565|-4.1801278|117.2370007 unknown
InChI: InChI=1S/C17H15NO2/c1-17(10-18)8-7-14-13-6-4-12(20-2)9-11(13)3-5-15(14)16(17)19/h3-6,9H,7-8H2,1-2H3
charge 0 multiplicity 1
35 atoms
O  3.303081 -2.015981 -0.209058
O  -5.25379 -0.087873 0.268115
N  3.552392 1.460342 2.141844
C  3.384601 0.438926 -0.326294
C  2.524975 1.387443 -1.21491
C  1.106192 1.586844 -0.651132
C  0.406646 0.272366 -0.332009
C  1.154421 -0.917425 -0.172532
C  2.639435 -0.941438 -0.235461
C  -1.028021 0.22438 -0.187733
C  4.81019 0.248509 -0.904017
C  -1.686577 -1.043045 0.081426
C  0.490234 -2.169634 0.088265
C  -0.887421 -2.233948 0.207219
C  3.47657 0.998354 1.043332
C  -1.851965 1.393164 -0.28822
C  -3.101475 -1.091075 0.221319
C  -3.239442 1.334529 -0.141513
C  -3.873293 0.074946 0.112121
C  -6.106392 1.103055 0.18076
H  2.471506 0.936611 -2.225188
H  3.036464 2.362476 -1.311325
H  0.512778 2.167258 -1.381096
H  1.159281 2.204697 0.269574
H  5.372395 -0.491494 -0.313824
H  4.742357 -0.126313 -1.940459
H  5.355716 1.207757 -0.903721
H  1.11779 -3.059784 0.195271
H  -1.386993 -3.187935 0.409483
H  -1.389742 2.368256 -0.469551
H  -3.605517 -2.041858 0.421482
H  -3.829886 2.252086 -0.217603
H  -5.853689 1.837413 0.969362
H  -7.129072 0.730656 0.33651
H  -6.031747 1.579936 -0.815338
