program: Gaussian 09
title: 000027509
version: EM64L-G09RevD.01
frameworkgroup: C1[X(C9H11FN2)]
method: RPBEPBE
basis: SDD
operation: Freq
keyword: #p
keyword: freq=noraman
keyword: PBEPBE/SDD
title: #p freq=noraman PBEPBE/SDD
converged: YES YES NO NO
title: Mulliken charges:
elementType: F N N C C C C C C C C C H H H H H H H H H H H
charge: -0.216170 -0.079649 -0.137064 0.239514 -0.147015 -0.628025 -0.590253 -0.338058 -0.321745 -0.346871 -0.358505 0.302241 0.215440 0.223707 0.290948 0.221185 0.230148 0.224581 0.230942 0.250669 0.235679 0.250622 0.247679
chargesum: 0.00000
title: Mulliken charges with hydrogens summed into heavy atoms:
elementType: F N N C C C C C C C C C
charge: -0.216170 -0.079649 -0.137064 0.239514 0.068425 0.107815 0.095418 -0.087389 -0.086066 -0.096249 -0.110826 0.302241
polarizability: 2.06160420e+02 3.31561473e+00 1.03914058e+02 -1.96417955e+00 -6.36481357e+00 6.08292742e+01
1716.lowfreq: -14.8795 -7.4840 -0.0010 -0.0007 -0.0007 2.6129 43.6082 62.3736 73.9527
frequency: 43.1278 62.3610 73.9014 92.3516 128.8488 170.8925 215.6817 241.5258 309.5407 344.3444 361.1519 401.9387 413.1089 419.2266 488.1909 527.0312 566.7272 629.9662 713.1844 754.2707 799.7449 827.8958 830.9670 880.2293 922.9477 947.1545 950.4293 996.3798 1057.6176 1086.1264 1094.2683 1097.6914 1143.1900 1148.9963 1181.1409 1209.5514 1242.0604 1282.0435 1352.4407 1371.6382 1402.2772 1412.0948 1415.6174 1440.0553 1457.9788 1471.5901 1484.7091 1489.8959 1509.9608 1582.6563 1608.1895 1645.0170 2953.2451 2962.4312 2983.0321 3024.2489 3036.9354 3086.6833 3112.2354 3132.4655 3154.9843 3167.9005 3177.0407
redmass: 2.5329 5.2922 1.8323 2.0985 1.1991 4.9269 2.0334 4.4311 5.2092 3.0469 5.3780 4.4769 3.2242 3.1157 4.4214 2.7180 5.5848 7.0945 3.5916 6.5322 1.2751 1.6792 5.3662 4.0334 1.3694 1.3530 1.4625 2.7010 1.3664 1.8552 1.2457 1.2694 1.3717 1.3465 2.0780 4.2338 3.6189 1.2760 5.6202 1.4323 3.1217 1.8946 1.5781 1.1959 1.0440 1.1084 1.1001 1.7832 1.4677 7.6563 6.7198 5.9450 1.0360 1.0369 1.0862 1.1008 1.1010 1.0979 1.0978 1.0889 1.0882 1.0957 1.0976
irintensity: 0.5948 0.5212 0.5563 0.6131 0.2781 3.9030 1.4707 3.3695 4.3471 19.7824 1.7491 4.2148 0.4844 0.7657 12.9244 17.8277 15.9569 0.2990 1.9864 35.2607 6.3007 87.2082 1.3375 8.6761 1.3371 5.8843 23.1547 4.1378 5.4248 245.2438 6.0904 12.7350 2.2417 17.5817 69.6484 8.2274 23.1386 1.3389 0.9394 53.3148 33.8247 19.8027 34.4263 10.7761 8.9630 18.0085 44.6987 151.3205 62.0047 5.6293 88.7974 808.4864 88.6251 139.8000 48.9847 47.4309 34.2037 26.4351 1.1712 13.1632 7.2154 8.0172 5.0227
temp: 298.150 k
press: 1.00000 atm
elementType: 9 7 7 6 6 6 6 6 6 6 6 6 1 1 1 1 1 1 1 1 1 1 1
symmnumber: 1
zpe: 479051.3 jmol-1
zpe.correction: 0.182461 hartree
zpe.thermalcorrener: 0.194536 hartree
zpe.thermalcorrenthalpy: 0.195480 hartree
zpe.thermalcorrgfe: 0.143320 hartree
zpe.sumelectzpe: -557.998940 hartree
zpe.sumelectthermal: -557.986865 hartree
zpe.sumelectthermalent: -557.985921 hartree
zpe.sumelectthermalfe: -558.038081 hartree
dipole: -5.7840 -1.3173 -0.5330
dipole: 5.9560
quadrupole: -66.2600 -64.0024 -72.7506
quadrupole: 4.6714 0.9402 -1.2070
quadrupole: 1.4110 3.6687 -5.0796 4.6714 0.9402 -1.2070
hfenergy: -558.1814009 hartree
pointgroup: C01 [X(C9H11F1N2)]
dipole: 2.2549749 0.0806866 -0.6320177 debye
dipolederiv: -1.3466697 0.0572628 -0.0703585 0.0781289 -0.192492 0.0347874 -0.1241912 0.0370675 -0.1819777 -1.8625303 -0.0231812 0.2192037 -0.0859829 -0.3399116 0.0339496 -0.1967426 0.006093 -0.4268576 -1.9969711 -0.0071405 0.0920575 -0.2606988 -0.2944728 0.0573872 0.717244 0.0441846 -0.501399 1.605674 -0.0585101 0.0014855 -0.0551899 -0.0047805 0.0437832 0.0611302 0.018006 0.0186803 2.4395193 0.0660451 -0.268005 0.3217368 0.0397802 -0.1151061 -0.4836543 -0.0442615 0.4308166 0.1183843 -0.0251906 0.1800907 -0.0496518 0.2824308 0.0023218 0.5143463 -0.0043059 0.2296141 0.5338835 0.0113327 -0.2308594 0.0890987 0.2763782 -0.000684 -0.5321065 0.0146943 0.2834588 -0.3099084 0.0716806 -0.0295914 -0.2069888 -0.0131561 -0.1446721 0.1424423 -0.1176592 -0.0504107 -0.2377393 -0.0362313 0.0879716 0.2849147 -0.0325621 -0.0899505 -0.1565807 -0.1061369 -0.1204437 -0.0393307 -0.0303311 0.0363782 0.1494997 -0.0550149 -0.0895349 -0.0725815 -0.0844284 -0.0867288 -0.1469596 0.086256 -0.0524594 -0.1282218 -0.036189 -0.0918696 0.1041659 -0.0843207 -0.077699 1.258392 -0.0724091 0.100128 -0.0253615 0.1071213 -0.0492543 0.0815106 -0.0477876 0.0937761 0.0388395 0.0103142 -0.0477438 -0.0911597 0.1555162 0.0700713 -0.0057625 0.0390197 -0.19032 -0.0403058 0.1108662 -0.0643198 0.1924859 -0.1033792 0.0316495 -0.091702 -0.035778 0.0559876 0.1582569 -0.0026561 0.1326551 0.0050591 0.1235707 0.0126618 0.0662151 0.0058416 0.0361558 -0.0944065 -0.1067906 -0.0985619 -0.1657658 -0.0653696 -0.0516974 -0.0919591 0.0072685 0.0682404 -0.1365861 -0.1121095 0.0603767 -0.194923 -0.0654047 0.0007261 0.0178206 -0.0639134 0.0641531 0.0535946 0.0283988 -0.1445201 0.0085274 0.1144962 0.0345559 -0.0340271 0.0289048 -0.0771379 -0.1262119 0.0897639 0.0975204 0.1962041 -0.0972088 -0.0583094 0.1117247 0.0190596 0.0558914 0.0789089 0.0532836 -0.0576611 0.0395695 0.0408204 0.0991702 -0.0459829 0.0979815 0.0742155 -0.0016075 -0.0930294 0.0487876 -0.0818525 0.036412 0.0798343 0.0276321 0.0858723 0.0942129 0.0131416 -0.0644267 0.0494917 -0.0775737 0.0748418 0.085534 0.0540018 0.0843688 0.1095493 0.0406323 0.0468023 -0.0420664 0.0581454 0.0485737 0.104646 -0.062943 0.1002292 0.0982227 unknown
polarizability: 205.9161517|0.5484282|80.3397939|-6.6046676|-22.3845389|84.6478064 unknown
InChI: InChI=1S/C9H11FN2/c1-12(2)7-11-9-5-3-8(10)4-6-9/h3-7H,1-2H3
charge 0 multiplicity 1
23 atoms
F  -4.488194 0.177483 -0.19307
N  3.325114 -0.047583 -0.274636
N  1.096898 -0.271561 0.488857
C  -0.293186 -0.129972 0.268182
C  1.960037 -0.05662 -0.478449
C  3.887719 -0.237728 1.069119
C  4.263472 0.05731 -1.395836
C  -1.171875 -1.002479 0.974068
C  -0.863788 0.871492 -0.576181
C  -2.569315 -0.911286 0.819922
C  -2.262474 0.975919 -0.735577
C  -3.085443 0.075275 -0.039992
H  1.671326 0.110095 -1.534852
H  4.453752 -1.188307 1.130159
H  3.053023 -0.269588 1.785874
H  4.570229 0.595605 1.324444
H  4.96005 0.905538 -1.247677
H  3.712042 0.222138 -2.33708
H  4.865733 -0.867173 -1.504533
H  -0.730926 -1.751624 1.638486
H  -0.211106 1.594591 -1.078857
H  -3.248859 -1.582899 1.352921
H  -2.710727 1.744374 -1.372793
