program: Gaussian 09
title: 000287633
version: EM64L-G09RevD.01
frameworkgroup: C1[X(C14H22O4)]
method: RPBEPBE
basis: SDD
operation: Freq
keyword: #pfreq=noraman
keyword: PBEPBE/SDD
title: #p freq=noraman PBEPBE/SDD
converged: YES YES NO NO
title: Mulliken charges:
elementType: O O O O C C C C C C C C C C C C C C H H H H H H H H H H H H H H H H H H H H H H
charge: -0.284988 -0.294328 -0.284989 -0.294327 -0.119723 -0.119723 0.283233 0.283233 -0.471982 -0.471982 -0.477371 -0.477371 -0.395885 -0.395885 -0.311927 -0.333839 -0.311926 -0.333840 0.260156 0.260157 0.216707 0.220242 0.220241 0.216708 0.207507 0.222150 0.222150 0.207507 0.196546 0.218087 0.218086 0.196546 0.206134 0.221773 0.205689 0.231821 0.221773 0.206133 0.231821 0.205689
chargesum: 0.00000
title: Mulliken charges with hydrogens summed into heavy atoms:
elementType: O O O O C C C C C C C C C C C C C C
charge: -0.284988 -0.294328 -0.284989 -0.294327 0.140433 0.140433 0.283233 0.283233 -0.035033 -0.035032 -0.047714 -0.047714 0.018747 0.018747 0.115979 0.103671 0.115980 0.103669
polarizability: 1.85237718e+02 6.85359698e+00 1.49352043e+02 -3.59194157e+00 -1.37961273e+00 1.24428630e+02
1716.lowfreq: -21.7218 -14.4023 -0.0009 -0.0008 -0.0007 4.1329 42.5555 77.6230 88.0250
frequency: 42.5555 77.6230 87.6234 110.1744 115.8534 174.1070 178.8376 203.3637 220.9484 233.6723 268.9221 285.5574 296.1162 327.6490 341.9349 343.0783 379.1560 450.8518 462.5499 471.2241 499.5022 557.7019 574.9061 614.9615 616.2267 647.2043 664.5552 716.1536 725.0779 815.3809 817.9971 829.1842 844.2374 862.5724 865.8906 875.2311 885.2450 899.0758 915.6132 918.3710 921.9981 968.4716 985.4028 985.7183 992.8850 1003.7214 1008.9425 1032.9042 1045.2238 1051.7109 1071.5714 1091.3725 1106.5980 1107.9138 1122.5069 1128.4761 1134.9248 1154.3128 1162.1820 1166.0340 1183.7680 1195.8621 1197.0082 1202.7473 1214.1670 1249.7232 1249.8850 1271.1114 1274.4968 1300.2396 1301.7209 1315.9528 1317.3742 1317.6840 1325.1614 1327.3669 1329.4483 1331.5750 1341.4506 1345.3995 1349.1555 1352.2834 1454.9785 1456.0360 1465.8059 1466.2832 1471.4900 1472.7396 1473.9263 1475.8889 1484.7264 1484.8635 2975.1949 2978.8559 2979.1487 2981.5845 2983.3695 2985.9262 2986.4848 2987.8559 2989.6208 2991.7731 2995.0398 2996.7383 3039.2253 3039.5920 3048.9983 3049.2175 3058.8767 3060.6189 3078.3626 3078.4933 3095.6714 3095.7361
redmass: 4.4179 3.2234 3.3980 3.1647 3.3222 2.9503 2.6610 3.4267 2.4408 3.8894 2.0271 4.2529 2.5477 3.2123 4.3126 3.6655 2.3201 4.4104 2.6641 3.5059 2.3637 2.7888 2.7716 2.3927 2.3525 5.6905 4.1476 4.3845 5.9425 2.1578 2.5306 2.6522 2.0099 2.2100 1.8663 1.7671 2.7135 1.6656 3.2223 3.0294 2.4684 3.4879 3.3862 3.2134 3.9435 1.6258 2.9182 3.0944 2.0921 1.5123 1.5071 2.0230 1.6298 1.6385 2.4215 3.0213 1.7528 1.9883 1.1531 1.3605 1.7600 1.2878 1.3371 1.9955 1.5898 1.4014 1.3685 1.4641 1.7231 1.2371 1.5827 1.3997 1.3842 1.3359 1.3050 1.2616 1.3179 1.4500 1.4408 1.4075 1.4511 1.6843 1.0909 1.0936 1.0832 1.0856 1.0881 1.0898 1.0899 1.0918 1.0888 1.0898 1.0794 1.0685 1.0686 1.0630 1.0583 1.0643 1.0621 1.0621 1.0620 1.0678 1.0624 1.0694 1.0998 1.0991 1.1020 1.1023 1.1032 1.1026 1.1000 1.0999 1.1013 1.1013
irintensity: 0.6103 8.3469 0.0000 3.7860 0.0000 4.9271 0.0000 10.1610 7.0499 0.0000 0.0000 0.0000 7.4489 0.0000 2.9300 0.0000 0.9062 0.0000 8.4924 18.3459 0.0000 0.0000 9.4586 0.0000 4.6763 5.0371 0.0000 0.0000 22.5061 21.0165 0.0000 66.7075 0.0000 6.2084 0.0000 0.0000 30.5751 12.6970 0.0000 101.8093 0.0000 0.0000 0.0000 33.5140 109.7363 3.6576 0.0000 0.0000 30.9365 0.0000 99.2803 36.3283 0.0000 2.8049 0.0000 105.3027 0.0000 0.0000 1.2435 0.0000 58.7078 0.0000 3.7164 0.0000 28.6078 22.0910 0.0000 0.0000 63.0886 7.7120 0.0000 0.0000 12.8288 0.0000 10.3694 0.0000 1.4723 0.0000 2.5509 0.0000 9.6049 0.0000 20.3946 0.0000 18.0477 0.0000 0.0000 18.8468 10.8113 0.0000 3.0851 0.0000 0.0000 129.5326 0.0158 16.7267 0.0001 78.3458 0.0001 106.8217 0.0001 58.8125 0.0000 75.4439 79.7817 0.0001 55.5863 0.0031 0.0000 102.9779 83.9902 0.0832 0.0685 63.2292
temp: 298.150 k
press: 1.00000 atm
elementType: 8 8 8 8 6 6 6 6 6 6 6 6 6 6 6 6 6 6 1 1 1 1 1 1 1 1 1 1 1 1 1 1 1 1 1 1 1 1 1 1
symmnumber: 1
zpe: 902800.5 jmol-1
zpe.correction: 0.343859 hartree
zpe.thermalcorrener: 0.359795 hartree
zpe.thermalcorrenthalpy: 0.360739 hartree
zpe.thermalcorrgfe: 0.301486 hartree
zpe.sumelectzpe: -846.134770 hartree
zpe.sumelectthermal: -846.118834 hartree
zpe.sumelectthermalent: -846.117890 hartree
zpe.sumelectthermalfe: -846.177143 hartree
dipole: 0.0000 -0.0001 0.0000
dipole: 0.0001
quadrupole: -85.5357 -103.9020 -115.8695
quadrupole: 3.0622 -8.4304 -3.0458
quadrupole: 16.2334 -2.1329 -14.1004 3.0622 -8.4304 -3.0458
hfenergy: -846.4786287 hartree
pointgroup: C01 [X(C14H22O4)]
dipole: -0.0000075 -0.0000204 0.0000007 debye
polarizability: 184.9767887|-7.6479155|149.2184444|-3.9933599|-2.5328786|124.8231587 unknown
InChI: InChI=1S/C14H22O4/c1-3-11-12(13(5-1)15-7-8-16-13)4-2-6-14(11)17-9-10-18-14/h11-12H,1-10H2
charge 0 multiplicity 1
40 atoms
O  2.945068 -0.148942 1.146917
O  2.377387 -0.025422 -1.158866
O  -2.945042 0.148948 -1.146952
O  -2.377376 0.025424 1.158834
C  0.545583 -0.311052 0.462727
C  -0.545563 0.311054 -0.462751
C  1.9079 0.363937 0.197234
C  -1.907881 -0.363935 -0.197262
C  0.609239 -1.849856 0.321002
C  -0.60922 1.849858 -0.321024
C  1.855319 1.893983 0.332737
C  -1.855299 -1.893981 -0.332764
C  -0.768962 -2.493315 0.589077
C  0.768979 2.493319 -0.589101
C  3.97314 -0.860079 0.357651
C  3.833359 -0.242783 -1.046115
C  -3.973133 0.860062 -0.35769
C  -3.83335 0.242764 1.046076
H  0.277923 -0.064334 1.511488
H  -0.277901 0.064338 -1.511512
H  1.358471 -2.247829 1.030719
H  0.951682 -2.099289 -0.702214
H  -0.951662 2.099289 0.702194
H  -1.358456 2.24783 -1.030738
H  2.852414 2.310498 0.09639
H  1.641195 2.136587 1.39155
H  -1.641171 -2.136586 -1.391576
H  -2.852394 -2.310498 -0.096421
H  -0.715489 -3.588701 0.43988
H  1.060942 2.319545 -1.64323
H  -1.060927 -2.319539 1.643206
H  0.715506 3.588705 -0.439901
H  3.762051 -1.947381 0.342889
H  4.95039 -0.670239 0.831773
H  4.381119 0.717776 -1.124191
H  4.126227 -0.913458 -1.86907
H  -4.950377 0.670208 -0.831816
H  -3.762061 1.947368 -0.342923
H  -4.126234 0.913431 1.869031
H  -4.381097 -0.717804 1.124145
