program: Gaussian 09
title: 000287612
version: EM64L-G09RevD.01
frameworkgroup: C1[X(C12H19NO3)]
method: RPBEPBE
basis: SDD
operation: Freq
keyword: #p
keyword: freq=noraman
keyword: PBEPBE/SDD
title: #p freq=noraman PBEPBE/SDD
converged: NO YES NO NO
title: Mulliken charges:
elementType: O O O N C C C C C C C C C C C C H H H H H H H H H H H H H H H H H H H
charge: -0.289692 -0.441192 -0.246095 -0.055310 -0.029647 -0.115212 -0.452548 -0.462244 -0.459102 -0.402930 -0.408465 0.056960 -0.469285 -0.171764 0.306922 -0.759854 0.218627 0.243347 0.199799 0.196134 0.212198 0.210474 0.217621 0.208541 0.195348 0.198938 0.190276 0.202261 0.222004 0.250277 0.320755 0.368902 0.249936 0.249257 0.244765
chargesum: 0.00000
title: Mulliken charges with hydrogens summed into heavy atoms:
elementType: O O O N C C C C C C C C C C C C
charge: -0.289692 -0.072290 -0.246095 -0.055310 0.188979 0.128135 -0.056616 -0.039573 -0.032940 -0.008644 -0.015929 0.056960 0.002996 0.148992 0.306922 -0.015896
polarizability: 1.63481391e+02 -3.03211259e+00 1.47908844e+02 3.81291813e+00 -1.32158693e+00 1.19453560e+02
1716.lowfreq: -48.7681 -24.9149 -7.0310 0.0004 0.0006 0.0006 10.5493 35.4416 48.5250
frequency: -48.7319 35.0082 48.3461 68.0917 77.4342 140.4037 149.6644 176.9182 208.1114 228.6661 250.0304 278.4486 314.8768 337.1297 342.6073 385.3903 394.4983 425.1472 433.1544 454.3222 464.2851 521.1115 571.0086 575.0904 617.2659 632.6383 683.6928 761.4691 797.9385 818.1557 840.2475 842.4827 854.7775 883.8873 891.6559 896.6233 919.7900 960.6837 980.2331 992.5481 1000.7301 1045.3586 1051.7054 1056.8814 1057.7865 1095.7520 1109.9450 1116.2822 1132.2600 1168.9542 1174.4689 1191.2766 1203.5668 1217.6772 1234.5444 1253.1825 1274.0270 1278.0169 1292.1761 1306.7030 1314.0684 1326.1558 1334.4045 1335.6851 1340.6115 1346.6691 1349.4310 1357.5752 1359.3602 1381.5254 1455.0426 1457.2633 1458.5350 1461.2653 1463.6441 1467.2583 1469.5277 1475.8619 1606.2455 1640.4632 2926.7527 2942.3925 2956.6699 2965.9479 2966.9739 2978.3870 2988.2220 2988.8510 3008.5238 3018.4511 3029.2488 3035.4691 3038.3354 3053.2729 3059.6091 3091.1801 3097.2372 3140.0535 3569.1869
redmass: 1.0714 5.0681 6.5904 2.9895 3.7025 3.1755 3.2506 5.2042 5.4421 2.6698 4.1525 3.6007 2.1723 2.3156 2.5430 3.8987 3.2279 1.5671 2.1724 2.5996 3.6360 1.8282 4.4454 3.2491 4.2720 3.6157 4.2356 2.0936 3.4642 3.2445 2.1288 1.7206 2.6342 2.9686 2.1233 2.9956 3.2805 2.4111 1.6177 1.9632 2.0285 1.6300 1.7210 1.8229 1.4608 1.8943 2.4689 1.9334 1.8824 1.6548 1.4935 3.1428 1.4331 1.4868 1.3528 1.3144 1.2890 1.2944 1.1934 1.6459 1.4952 1.3168 1.3833 1.3764 1.4091 1.5431 1.5416 1.4712 1.7592 1.2260 1.0659 1.0483 1.0843 1.0865 1.0893 1.0870 1.0818 1.0942 7.4115 10.5770 1.0787 1.0818 1.0631 1.0646 1.0624 1.0603 1.0648 1.0633 1.0362 1.0984 1.0958 1.1007 1.1003 1.1013 1.0992 1.0861 1.0973 1.1013 1.0675
irintensity: 1.5358 0.0040 1.9561 0.8395 0.8051 0.8996 1.1726 2.1113 6.8402 1.0443 0.6233 0.9891 0.5280 1.7610 7.6771 4.8369 0.2650 68.1171 62.7009 10.8518 2.0220 0.8205 11.6377 2.3750 12.0944 3.0545 12.5511 0.2489 35.4594 7.6942 5.3126 9.6622 2.7209 39.7973 51.6933 68.8549 67.2595 12.6942 23.6297 37.5306 12.1734 9.8092 6.0589 5.8379 1.6198 26.1051 0.3040 0.3722 7.7030 9.3223 45.7346 313.3135 75.2666 6.1172 17.9884 0.2167 8.7859 5.8083 5.3413 2.8588 2.0568 2.1843 0.5595 5.4950 1.1006 2.8704 0.3090 5.1659 2.0787 49.2688 11.7150 14.5248 10.2172 8.8779 8.2681 6.4158 20.1681 4.9020 4.1892 198.7988 0.4591 14.2440 36.5792 35.9765 33.8440 47.0412 13.2066 22.9225 3.8027 39.8736 70.0729 46.4208 69.7590 53.4621 32.1561 0.6014 6.2488 9.5223 46.8890
temp: 298.150 k
press: 1.00000 atm
elementType: 8 8 8 7 6 6 6 6 6 6 6 6 6 6 6 6 1 1 1 1 1 1 1 1 1 1 1 1 1 1 1 1 1 1 1
symmnumber: 1
zpe: 776199.9 jmol-1
zpe.correction: 0.295639 hartree
zpe.thermalcorrener: 0.310827 hartree
zpe.thermalcorrenthalpy: 0.311772 hartree
zpe.thermalcorrgfe: 0.253019 hartree
zpe.sumelectzpe: -747.814079 hartree
zpe.sumelectthermal: -747.798891 hartree
zpe.sumelectthermalent: -747.797947 hartree
zpe.sumelectthermalfe: -747.856700 hartree
dipole: 1.9633 -1.0288 0.9011
dipole: 2.3927
quadrupole: -103.9306 -87.9958 -92.7858
quadrupole: 1.6058 -8.2356 -1.9708
quadrupole: -9.0266 6.9082 2.1183 1.6058 -8.2356 -1.9708
hfenergy: -748.1097184 hartree
pointgroup: C01 [X(C12H19N1O3)]
dipole: -0.7840635 0.4036116 0.3294312 debye
polarizability: 163.6838345|-3.1487921|147.8926907|-2.0002736|1.7524806|119.2672704 unknown
InChI: InChI=1S/C12H19NO3/c1-8(14)16-11-7-6-9-4-2-3-5-10(9)12(11)13-15/h9-11,15H,2-7H2,1H3
charge 0 multiplicity 1
35 atoms
O  1.753297 0.430488 0.654275
O  1.085964 -3.051699 -0.484824
O  3.90359 0.427157 -0.263684
N  -0.13689 -2.354684 -0.040643
C  -1.521291 0.793935 -0.863174
C  -1.180882 -0.186145 0.313001
C  -2.689184 1.7254 -0.459531
C  -0.269885 1.595003 -1.295245
C  -2.426487 -0.982534 0.76497
C  -3.934099 0.933235 0.000864
C  -3.580898 -0.032663 1.156374
C  0.006715 -1.048674 -0.083815
C  0.906078 0.673712 -1.683242
C  1.252593 -0.322603 -0.557548
C  3.12418 0.72604 0.669891
C  3.50684 1.434374 1.95273
H  -1.855224 0.170783 -1.723457
H  -0.839549 0.449732 1.161501
H  -2.945662 2.384219 -1.313036
H  -2.351016 2.388563 0.365075
H  0.040777 2.256617 -0.461606
H  -0.525324 2.251661 -2.149655
H  -2.160204 -1.643403 1.610333
H  -2.750355 -1.649138 -0.058457
H  -4.333192 0.348569 -0.853802
H  -4.734561 1.631074 0.31436
H  -3.285743 0.559811 2.047688
H  -4.471074 -0.623504 1.446439
H  0.638667 0.077495 -2.579084
H  1.810413 1.254244 -1.939824
H  2.043207 -1.021932 -0.871268
H  0.823346 -4.002403 -0.385359
H  4.252685 0.824963 2.492198
H  2.631109 1.600597 2.595814
H  3.985761 2.398511 1.709941
