program: Gaussian 09
title: 000287632
version: EM64L-G09RevD.01
frameworkgroup: C1[X(C18H24O3)]
method: RPBEPBE
basis: SDD
operation: Freq
keyword: #pfreq=noraman
keyword: PBEPBE/SDD
title: #p freq=noraman PBEPBE/SDD
converged: YES YES NO NO
title: Mulliken charges:
elementType: O O O C C C C C C C C C C C C C C C C C C H H H H H H H H H H H H H H H H H H H H H H H H
charge: -0.279752 -0.257934 -0.252948 0.336393 -0.042394 -0.482250 -0.368528 -0.466478 -0.487450 -0.418858 -0.407455 -0.813648 -0.598738 0.567445 -0.515795 0.306890 0.336489 -0.761880 -0.396296 -0.267424 -0.177677 0.218664 0.199228 0.223478 0.274933 0.194287 0.197952 0.216523 0.203073 0.204865 0.197111 0.191375 0.201441 0.241609 0.225023 0.214487 0.272255 0.215940 0.247712 0.248520 0.244290 0.244756 0.259186 0.252873 0.258706
chargesum: 0.00000
title: Mulliken charges with hydrogens summed into heavy atoms:
elementType: O O O C C C C C C C C C C C C C C C C C C
charge: -0.279752 -0.257934 -0.252948 0.336393 0.176270 -0.059545 -0.093595 -0.074239 -0.067853 -0.016882 -0.014639 -0.132530 -0.110543 0.567445 -0.268083 0.306890 0.336489 -0.024313 -0.137109 -0.014552 0.081029
polarizability: 2.88569846e+02 7.99389610e+00 1.79423113e+02 -1.31238201e+01 1.25321521e+01 1.65744767e+02
1716.lowfreq: -6.9929 -0.0003 0.0005 0.0008 2.9732 14.2389 30.0923 40.9153 45.3890
frequency: 29.7124 40.8223 45.3575 49.2092 68.2539 73.4756 86.1479 116.7080 139.6655 159.7418 169.2501 189.0940 219.8825 241.4276 258.8955 269.0371 290.4009 311.3914 327.1021 339.4329 373.1594 392.3982 409.4967 452.9874 471.6684 489.9534 525.7869 557.8740 576.1197 585.6202 589.6480 623.6836 656.1322 667.9574 704.8097 719.6733 735.4304 790.5515 802.4067 810.8852 836.8954 839.8764 858.7863 869.9823 875.7778 879.5642 886.8697 896.2791 903.1831 915.1236 945.1938 958.8924 974.9307 981.7764 995.6684 999.6129 1008.2288 1016.0041 1041.3815 1050.8154 1061.9722 1096.5240 1103.3859 1119.5882 1131.9676 1137.9814 1149.1227 1162.7674 1177.3127 1192.7795 1194.9724 1201.4855 1220.1836 1253.3258 1258.7911 1266.8746 1273.0668 1292.9876 1312.7327 1316.6751 1320.1590 1328.3375 1335.3892 1340.4356 1345.9416 1350.3513 1357.4339 1359.1185 1381.7288 1391.3952 1395.9712 1453.4760 1455.8413 1459.2173 1461.8769 1465.0744 1467.8643 1475.9907 1477.5856 1486.0120 1487.4517 1492.1393 1545.1709 1640.5195 1667.7814 2948.8935 2956.9504 2963.6947 2967.4134 2968.3329 2977.4138 2980.8882 2985.4956 3004.3951 3016.5223 3023.2425 3028.1183 3030.0795 3032.4659 3046.0966 3070.6328 3093.3521 3097.6583 3099.4617 3106.6794 3137.5068 3216.6071 3232.0266 3266.1201
redmass: 4.6311 1.7430 2.3258 3.5241 3.4327 3.0324 4.2209 3.5050 1.5747 2.6412 3.0455 3.1749 4.7274 2.1964 3.7559 2.8495 3.6027 2.8233 2.2763 2.7821 3.8783 2.7445 2.8490 2.9107 2.5379 2.8730 2.3478 2.8889 3.2432 3.3029 3.3328 4.2800 3.7447 3.5117 3.0185 1.2787 4.4827 2.3287 1.4324 1.7066 2.4175 2.7375 2.7057 5.9438 1.3617 4.0641 3.9191 1.6366 1.7468 2.2894 1.8708 1.8031 1.7300 1.8364 1.7846 1.8446 1.8724 2.1488 1.6500 2.1779 1.6506 2.3963 1.7055 1.6167 1.5340 2.0595 1.4416 2.4733 1.8108 2.0474 1.6801 2.9337 1.7162 1.3753 1.4400 2.2197 1.8084 1.2905 1.3171 1.3941 1.6256 1.3880 1.3384 1.4161 1.4315 1.4649 2.1834 1.5440 1.2395 1.3561 1.4753 1.0606 1.0525 1.1236 1.0884 1.0794 1.0810 1.6138 1.7986 1.0878 1.0710 1.0663 5.5321 9.6898 8.0191 1.0809 1.0698 1.0597 1.0633 1.0616 1.0587 1.0589 1.0434 1.0377 1.0991 1.0978 1.0861 1.1013 1.1015 1.1010 1.0958 1.0983 1.0949 1.0905 1.0883 1.1021 1.0922 1.0980 1.1082
irintensity: 0.4310 1.4211 0.1731 0.7276 0.2581 3.0173 0.0836 1.6921 0.1719 0.4957 1.0350 1.4496 5.9912 0.3067 1.5519 5.6235 2.2441 2.0156 0.3307 0.9237 3.3577 0.5313 0.7596 1.3916 4.1669 3.5919 2.0375 0.6006 7.2834 11.4018 1.8695 6.7360 0.8212 4.3356 2.8708 82.3333 6.8419 13.0170 11.0492 15.0018 11.8752 19.1919 2.9431 4.1014 3.6240 20.4153 99.6514 21.4790 25.3568 14.3390 20.8511 51.9738 2.2656 17.5740 36.0338 7.8349 17.6348 19.3444 8.6821 10.8110 0.6510 11.1686 2.4972 4.1174 11.8908 6.4720 2.4726 27.3996 5.0855 82.9544 6.4427 271.3448 8.5408 4.3353 4.5338 10.5509 0.9733 1.0264 5.4072 2.0550 5.1659 2.3251 0.9772 1.1005 0.3367 7.5080 0.1049 1.6001 59.0231 11.3953 9.2823 21.6379 19.3550 13.8912 0.5958 2.3602 12.6365 16.1040 7.4312 4.4062 1.4047 10.4100 6.4427 152.9833 0.9296 8.6968 11.9029 33.4593 15.9816 36.2688 60.7262 48.1255 33.5243 3.3028 35.7586 50.6573 13.1126 42.1231 44.8172 106.4878 26.9285 38.6871 10.2105 3.9759 5.8729 10.1201 7.0463 0.8319 0.1923
temp: 298.150 k
press: 1.00000 atm
elementType: 8 8 8 6 6 6 6 6 6 6 6 6 6 6 6 6 6 6 6 6 6 1 1 1 1 1 1 1 1 1 1 1 1 1 1 1 1 1 1 1 1 1 1 1 1
symmnumber: 1
zpe: 1000155.2 jmol-1
zpe.correction: 0.380939 hartree
zpe.thermalcorrener: 0.401309 hartree
zpe.thermalcorrenthalpy: 0.402253 hartree
zpe.thermalcorrgfe: 0.331060 hartree
zpe.sumelectzpe: -924.379298 hartree
zpe.sumelectthermal: -924.358929 hartree
zpe.sumelectthermalent: -924.357985 hartree
zpe.sumelectthermalfe: -924.429178 hartree
dipole: 0.2786 -1.0936 -1.0731
dipole: 1.5573
quadrupole: -113.0133 -128.0134 -122.4905
quadrupole: 4.8716 -0.9395 -4.2933
quadrupole: 8.1591 -6.8410 -1.3181 4.8716 -0.9395 -4.2933
hfenergy: -924.7602373 hartree
pointgroup: C01 [X(C18H24O3)]
dipole: 0.1225555 -0.3652438 -0.4763856 debye
polarizability: 287.0542561|15.2947235|177.1508234|-13.9216444|13.1065078|169.5326467 unknown
InChI: InChI=1S/C18H24O3/c1-13(19)21-17-14(12-16-7-5-11-20-16)8-9-15-6-3-4-10-18(15,17)2/h5,7,11-12,15,17H,3-4,6,8-10H2,1-2H3
charge 0 multiplicity 1
45 atoms
O  0.966691 1.728186 -0.284332
O  -3.442609 -1.19305 -0.777444
O  -0.201376 3.111799 1.197426
C  1.841579 -0.443984 0.541977
C  2.035444 -0.986008 -0.916691
C  3.13049 0.314989 0.977203
C  0.61473 0.515435 0.564837
C  3.298279 -1.872852 -1.040592
C  0.759485 -1.682699 -1.440648
C  4.404481 -0.555869 0.856973
C  4.568071 -1.11949 -0.57564
C  1.527864 -1.574195 1.564111
C  -0.476452 -0.740964 -1.385816
C  -0.647726 -0.097525 -0.020555
C  -1.811284 0.006905 0.698345
C  0.45374 2.957314 0.140961
C  -3.148363 -0.471105 0.411692
C  0.786281 4.043701 -0.861421
C  -4.326174 -0.349329 1.153598
C  -5.381804 -1.005277 0.421325
C  -4.814083 -1.50392 -0.739509
H  2.203371 -0.089099 -1.553115
H  3.013225 0.677276 2.019199
H  3.247084 1.209461 0.33559
H  0.434696 0.886541 1.591221
H  3.413721 -2.192335 -2.095981
H  3.173335 -2.801885 -0.447382
H  0.557008 -2.602943 -0.857682
H  0.920435 -2.002602 -2.489313
H  4.366509 -1.392598 1.582626
H  5.29078 0.051019 1.1272
H  4.761435 -0.278235 -1.273378
H  5.450682 -1.786645 -0.625766
H  0.557489 -2.060491 1.363707
H  2.306399 -2.35504 1.554698
H  1.48497 -1.158663 2.589124
H  -1.389673 -1.273875 -1.688627
H  -0.310574 0.072776 -2.124211
H  -1.764329 0.550103 1.65254
H  0.032256 4.035863 -1.669825
H  1.77332 3.870788 -1.318746
H  0.756268 5.026472 -0.3674
H  -4.415175 0.157574 2.112923
H  -6.425498 -1.094617 0.716003
H  -5.1929 -2.061209 -1.591707
