program: Gaussian 09
title: 000287629
version: EM64L-G09RevD.01
frameworkgroup: C1[X(C22H22O4)]
method: RPBEPBE
basis: SDD
operation: Freq
keyword: #pfreq=noraman
keyword: PBEPBE/SDD
title: #p freq=noraman PBEPBE/SDD
converged: YES YES NO NO
title: Mulliken charges:
elementType: O O O O C C C C C C C C C C C C C C C C C C C C C C H H H H H H H H H H H H H H H H H H H H H H
charge: -0.176299 -0.283556 -0.274288 -0.261411 0.056778 0.211265 -0.513664 -0.567641 0.068303 0.186722 0.142890 0.032398 -0.602212 -0.758224 0.189558 -0.396107 0.458087 0.149542 -0.528115 -0.381875 -0.594522 -0.390451 0.325056 -0.253612 -0.667365 -0.536104 0.232708 0.249165 0.234736 0.237669 0.266041 0.280755 0.245048 0.246620 0.228550 0.308497 0.241045 0.246750 0.267021 0.241819 0.234129 0.221024 0.216578 0.225130 0.250057 0.221402 0.248110 0.221991
chargesum: 0.00000
title: Mulliken charges with hydrogens summed into heavy atoms:
elementType: O O O O C C C C C C C C C C C C C C C C C C C C C C
charge: -0.176299 -0.283556 -0.274288 -0.261411 0.056778 0.211265 -0.031790 -0.095235 0.068303 0.186722 0.142890 0.032398 -0.055416 -0.038006 0.189558 -0.087611 0.458087 0.149542 -0.287069 -0.135125 -0.327501 -0.148632 0.325056 0.201540 0.024400 0.155399
polarizability: 4.84043953e+02 -7.67137352e+00 2.57640790e+02 6.93499650e-01 -1.07520294e+01 1.41894111e+02
1716.lowfreq: -0.0008 -0.0005 0.0000 1.5483 4.3247 7.9776 21.4566 31.2693 37.8835
frequency: 21.2582 31.2660 37.8515 58.9804 72.4087 81.1066 96.2946 105.4983 114.5840 139.8721 143.4584 180.6437 194.5844 203.9486 210.3143 221.2566 228.4656 242.9820 252.4197 268.0034 282.7053 287.4683 327.5946 338.0489 350.2073 366.1320 377.7087 419.1963 422.8792 430.8082 469.2178 486.3264 515.9987 529.1795 544.3532 552.8885 570.6097 595.7606 616.6783 625.2429 649.6039 690.9009 693.7352 708.5527 736.9622 745.0456 761.9803 783.2453 797.0658 813.9570 817.8646 835.4434 844.3156 882.8975 893.2674 906.7477 908.9887 913.4124 946.3832 950.2357 968.9629 980.8578 998.9049 1007.7708 1017.9561 1027.8524 1056.7144 1075.5086 1093.7468 1099.8903 1100.9750 1110.1574 1135.4734 1145.0644 1151.4028 1165.1125 1173.0369 1176.2715 1192.1988 1207.4083 1219.9878 1238.0106 1240.9157 1262.8262 1271.5204 1275.9698 1279.7852 1309.1971 1328.1893 1347.3629 1357.0840 1372.5900 1377.1809 1388.8416 1389.9891 1403.8583 1417.0047 1432.7903 1437.6977 1454.4371 1455.3531 1462.0927 1462.4859 1468.7971 1470.4814 1473.7487 1479.1296 1484.4978 1485.9425 1510.0308 1553.0866 1562.5171 1593.7808 1611.0765 1634.3455 1664.8902 2961.4862 2963.7487 2985.8647 2988.9668 2990.5738 2992.0963 3017.8584 3029.0856 3044.0772 3050.5595 3059.2011 3082.8934 3086.7373 3091.9531 3095.0252 3117.4860 3125.9817 3132.7069 3146.3618 3153.8621 3168.7048 3180.6049
redmass: 4.2764 4.7862 4.5171 3.8108 4.3480 3.8783 3.6646 4.2846 3.6075 3.2298 3.5586 2.2690 3.3004 1.5409 3.5211 1.3127 1.4793 1.9567 3.7079 2.9923 3.4281 2.5067 3.4957 4.0418 4.6357 4.3579 4.0161 3.9878 4.2685 3.9597 4.5129 4.9076 3.1423 4.4526 4.3261 3.0819 3.5726 5.2720 4.2660 4.0322 3.7708 5.3187 4.7186 6.2348 3.7896 3.0072 2.9288 2.0278 2.3523 2.1862 1.7672 1.4558 4.2528 2.2765 3.4923 1.7624 2.9461 2.7512 1.5822 1.9334 2.4781 2.9866 1.4076 3.7050 2.7204 2.1458 2.8434 2.4333 2.2327 2.0238 2.6391 1.2569 1.5380 1.4737 1.7163 1.5586 2.6300 2.8053 1.6955 1.6033 1.4352 2.1227 2.1542 2.6201 2.0019 2.1943 1.1216 2.1059 1.7892 1.5280 1.3707 2.1984 1.2701 1.2336 3.3206 4.4733 1.1073 2.8409 1.6743 1.1309 1.1788 1.0648 1.0442 1.0511 1.2168 1.1109 1.3731 1.0517 1.1647 3.3186 7.1348 8.6296 8.8555 6.4304 6.7479 12.1993 1.0330 1.0633 1.0349 1.0653 1.0643 1.0361 1.0924 1.0589 1.0933 1.1041 1.1019 1.1000 1.0977 1.1033 1.1005 1.1057 1.0994 1.0907 1.0861 1.0919 1.0958 1.0951
irintensity: 2.6180 0.0533 0.4122 0.4474 0.5805 8.1944 0.2215 0.6881 6.2099 0.8641 4.1367 0.3164 2.5546 0.4624 0.7749 0.0709 3.9694 0.4912 0.9527 1.5503 5.4731 4.8603 28.5838 6.2679 3.8063 3.4932 0.2157 3.4894 3.9367 2.7842 0.3599 0.6928 3.1398 5.6915 16.2689 10.3285 1.5420 0.5984 1.5169 6.2247 4.1339 5.9719 10.6947 1.2031 6.8566 17.4248 9.3527 12.0216 15.0250 27.8082 1.1456 10.7388 4.3128 3.6085 1.9612 59.3264 15.9587 1.5830 10.3301 30.3979 8.3361 9.8035 1.9235 112.2413 118.3878 37.4290 255.0228 0.5543 95.9372 10.8225 85.6794 0.2223 39.2414 29.9661 183.3998 178.5331 8.8482 410.2065 8.4378 7.4435 5.2586 11.9381 3.2895 105.3488 107.3494 28.8308 1.2315 6.9283 0.7724 0.4105 1.0818 26.9923 16.5070 29.0611 8.0117 2.6961 7.1553 19.5430 4.3697 27.3433 17.4409 8.1953 11.8853 14.2570 72.1897 23.0763 12.7731 12.6192 5.2127 30.4700 222.7240 312.4837 104.4754 21.4668 192.8141 190.7712 101.7866 24.5600 21.7491 12.8492 16.6758 28.3659 27.2608 41.5523 1.7638 47.4097 23.3583 16.1743 39.6979 2.6107 17.7861 37.7578 28.7872 12.1994 5.7622 6.2771 20.3193 45.0513
temp: 298.150 k
press: 1.00000 atm
elementType: 8 8 8 8 6 6 6 6 6 6 6 6 6 6 6 6 6 6 6 6 6 6 6 6 6 6 1 1 1 1 1 1 1 1 1 1 1 1 1 1 1 1 1 1 1 1 1 1
symmnumber: 1
zpe: 1009788.2 jmol-1
zpe.correction: 0.384608 hartree
zpe.thermalcorrener: 0.408504 hartree
zpe.thermalcorrenthalpy: 0.409448 hartree
zpe.thermalcorrgfe: 0.330704 hartree
zpe.sumelectzpe: -1150.572710 hartree
zpe.sumelectthermal: -1150.548814 hartree
zpe.sumelectthermalent: -1150.547870 hartree
zpe.sumelectthermalfe: -1150.626614 hartree
dipole: -3.0124 0.0595 -0.2467
dipole: 3.0230
quadrupole: -117.7622 -159.4487 -151.7852
quadrupole: -25.6505 3.8932 0.4107
quadrupole: 25.2365 -16.4500 -8.7865 -25.6505 3.8932 0.4107
hfenergy: -1150.9573181 hartree
pointgroup: C01 [X(C22H22O4)]
dipole: 1.1835196 0.0627712 0.0994984 debye
polarizability: 483.2531065|15.3656797|258.1653875|0.9950627|12.1336128|142.1603603 unknown
InChI: InChI=1S/C22H22O4/c1-4-26-21(24)18-12-19(23)22(2)10-9-16-15-8-6-14(25-3)11-13(15)5-7-17(16)20(18)22/h5-8,11H,4,9-10,12H2,1-3H3
charge 0 multiplicity 1
48 atoms
O  -3.59179 3.496543 0.144863
O  -4.540589 -1.485549 0.582026
O  -2.525756 -2.505264 0.020227
O  6.251853 -1.312957 -0.094945
C  -1.613495 2.053992 -0.250417
C  -1.500798 0.528903 -0.126517
C  -0.695881 2.713541 0.806393
C  0.770858 2.306639 0.571542
C  -3.100587 2.350334 0.01089
C  -0.128054 -0.018762 -0.122324
C  0.9663 0.842056 0.182278
C  -2.768086 -0.035431 0.014468
C  -3.859176 1.030222 0.064072
C  -1.284683 2.547902 -1.692836
C  2.316863 0.332668 0.125446
C  0.14305 -1.39475 -0.470177
C  2.562037 -1.051427 -0.234938
C  -3.184872 -1.442833 0.186437
C  1.435952 -1.890764 -0.527531
C  3.461648 1.151366 0.406778
C  3.894209 -1.551357 -0.293671
C  4.764738 0.651746 0.34359
C  4.984385 -0.719048 -0.008959
C  -5.12748 -2.844662 0.773924
C  -5.663031 -3.397428 -0.550547
C  7.423028 -0.483173 0.200936
H  -1.018928 2.385788 1.813405
H  -0.809926 3.812064 0.767157
H  1.348235 2.525497 1.49021
H  1.214822 2.94588 -0.219326
H  -4.57525 0.960412 -0.779172
H  -4.480527 0.962261 0.975733
H  -1.434676 3.640898 -1.748499
H  -0.24369 2.309845 -1.969307
H  -1.945546 2.067131 -2.436468
H  -0.703187 -2.051428 -0.676683
H  1.609974 -2.937939 -0.800111
H  3.324965 2.202913 0.674952
H  4.079719 -2.596162 -0.562564
H  5.607234 1.313719 0.564917
H  -4.353585 -3.507341 1.199058
H  -5.932824 -2.677431 1.507493
H  -6.171011 -4.363779 -0.373167
H  -6.392216 -2.702299 -1.001668
H  -4.839588 -3.5674 -1.264013
H  7.505827 0.366602 -0.5041
H  8.285514 -1.153427 0.073205
H  7.398026 -0.10431 1.241045
