program: Gaussian 09
title: 000287607
version: EM64L-G09RevD.01
frameworkgroup: C1[X(C16H18O4)]
method: RPBEPBE
basis: SDD
operation: Freq
keyword: #pfreq=noraman
keyword: PBEPBE/SDD
title: #p freq=noraman PBEPBE/SDD
converged: YES YES NO NO
title: Mulliken charges:
elementType: O O O O C C C C C C C C C C C C C C C C H H H H H H H H H H H H H H H H H H
charge: -0.267053 -0.252518 -0.413006 -0.233681 0.360016 -0.324112 0.131423 -0.601944 0.352867 -0.476912 -0.342062 -0.550619 -0.385741 -0.438888 0.268647 -0.274879 -0.236878 0.179355 -0.264553 -0.657371 0.270493 0.227056 0.223937 0.227694 0.215272 0.238001 0.274144 0.273965 0.258147 0.234222 0.226990 0.226588 0.222987 0.233699 0.211864 0.254114 0.229937 0.378801
chargesum: 0.00000
title: Mulliken charges with hydrogens summed into heavy atoms:
elementType: O O O O C C C C C C C C C C C C C C C C
charge: -0.267053 -0.252518 -0.034205 -0.233681 0.360016 -0.053619 0.131423 -0.150951 0.352867 -0.033946 -0.104061 -0.002510 -0.127594 -0.204666 0.268647 -0.047889 -0.010290 0.179355 0.192132 0.038545
polarizability: 2.14320434e+02 -3.49426443e+00 1.83901130e+02 5.72459542e+00 -3.56853293e+01 1.49912977e+02
1716.lowfreq: -12.1151 -3.0932 -0.0005 0.0006 0.0008 9.2811 19.3515 26.0422 39.9891
frequency: 18.0946 25.5482 39.9432 45.0720 48.3787 67.3176 84.3561 112.1001 129.5762 141.3494 173.0221 190.1888 203.2604 234.6231 251.5349 283.0087 300.0820 328.0415 388.0828 407.7682 417.8567 462.7216 479.2602 485.8428 495.6309 523.8274 571.1306 590.0210 611.5177 620.8321 637.5051 668.5423 698.8561 737.6018 760.4151 764.8393 783.5003 793.8400 816.5868 840.4223 855.2480 871.9501 879.3659 892.8246 925.8212 949.1664 983.1287 987.9473 1001.6307 1021.4073 1031.9891 1044.7209 1051.2604 1087.3444 1096.0565 1100.6031 1125.8749 1142.1968 1155.5315 1156.9044 1177.9958 1191.2776 1203.9201 1211.5799 1235.6813 1240.4067 1264.9173 1276.1004 1289.8328 1313.2235 1326.6669 1344.7407 1354.5731 1360.2487 1376.3582 1383.0893 1392.1478 1418.7321 1440.0896 1450.7049 1456.5102 1456.9275 1460.6800 1482.7791 1488.2731 1574.7434 1611.0762 1631.6686 1638.4891 1663.7010 2945.9263 2955.3479 2994.5267 3016.5889 3029.7867 3036.5307 3041.7339 3061.1477 3078.3523 3090.5585 3094.8495 3116.4477 3120.8214 3125.7233 3131.2977 3149.1050 3163.7784 3512.3621
redmass: 3.8923 4.7483 4.9568 3.8239 5.0822 5.2225 6.2527 4.3422 3.7494 3.9702 1.7229 2.3465 4.6595 2.5384 2.7193 2.1021 4.7607 4.0199 3.8928 3.6123 3.2305 3.3433 4.4669 1.8902 4.9815 4.1599 4.5884 4.1777 2.9790 3.6692 1.5912 3.4647 3.5485 2.8142 2.2214 2.1031 2.3313 3.1932 1.5938 1.5157 3.0541 3.0436 1.3668 2.6610 2.7694 1.4146 2.3141 1.4503 2.8930 3.1118 2.0965 2.2878 2.5143 2.3021 2.3712 2.9918 1.9704 2.0151 1.1983 1.6769 1.1102 1.5571 1.2870 1.9084 1.7475 1.4200 1.6169 1.1235 1.4078 1.7177 1.4727 1.5349 1.3414 2.0367 3.3982 2.0980 1.2309 1.0929 2.2932 1.1304 1.0973 1.0867 1.0515 1.0523 2.5369 6.1507 6.3044 7.9472 7.5741 8.2576 1.0695 1.0638 1.0362 1.0608 1.0593 1.0917 1.0952 1.0861 1.0967 1.0975 1.1037 1.0869 1.1057 1.0920 1.0887 1.0936 1.0994 1.0639
irintensity: 1.5993 0.0275 1.3206 0.1006 0.1872 1.1753 0.4526 0.0291 1.1752 0.4737 2.8196 2.5972 3.1623 3.2073 0.4986 3.2909 3.9502 15.6379 0.5704 5.2143 2.8968 0.1707 24.2352 21.7939 6.1928 58.2081 2.1427 4.0685 19.9627 8.0279 114.1287 6.7272 1.8621 13.6849 24.6644 28.8429 13.5708 19.9174 7.0497 11.9910 4.5710 0.5512 1.9205 3.7776 6.6349 1.5147 9.1442 1.8447 71.9045 20.4150 6.2497 8.4261 251.3322 13.9262 88.8498 98.9697 60.7232 80.3812 0.5571 22.2954 2.8016 6.7716 6.0962 18.3678 11.2677 17.8416 18.7263 5.1556 21.6476 1.3969 53.2186 18.1952 8.7444 62.5039 1.7312 0.3763 25.7321 37.7284 4.7912 12.7121 18.0407 7.9481 12.0066 15.3837 14.5546 2.1209 1.6883 111.1585 35.0003 189.8109 27.7158 37.8571 20.8295 8.0011 27.7283 43.1376 31.6165 2.1593 2.2048 35.0904 0.6508 7.2764 26.9144 15.2354 12.6411 27.7572 21.1167 24.9807
temp: 298.150 k
press: 1.00000 atm
elementType: 8 8 8 8 6 6 6 6 6 6 6 6 6 6 6 6 6 6 6 6 1 1 1 1 1 1 1 1 1 1 1 1 1 1 1 1 1 1
symmnumber: 1
zpe: 801349.0 jmol-1
zpe.correction: 0.305218 hartree
zpe.thermalcorrener: 0.324657 hartree
zpe.thermalcorrenthalpy: 0.325602 hartree
zpe.thermalcorrgfe: 0.254494 hartree
zpe.sumelectzpe: -919.937252 hartree
zpe.sumelectthermal: -919.917813 hartree
zpe.sumelectthermalent: -919.916868 hartree
zpe.sumelectthermalfe: -919.987976 hartree
dipole: -1.2494 -0.0964 0.1054
dipole: 1.2576
quadrupole: -108.7407 -106.1829 -117.7317
quadrupole: 2.0326 -4.4777 1.1436
quadrupole: 2.1444 4.7022 -6.8467 2.0326 -4.4777 1.1436
hfenergy: -920.24247 hartree
pointgroup: C01 [X(C16H18O4)]
dipole: 0.4383442 -0.0998374 0.2065938 debye
polarizability: 201.8700691|-25.5190449|176.0682851|18.6066338|32.790678|170.1961859 unknown
InChI: InChI=1S/C16H18O4/c1-2-20-16(19)14(10-15(17)18)13-9-5-7-11-6-3-4-8-12(11)13/h3-4,6,8-9,14,17H,2,5,7,10H2,1H3
charge 0 multiplicity 1
38 atoms
O  -1.894019 -1.496213 -0.553677
O  -2.910382 0.171191 0.723947
O  -2.219078 3.807403 -1.554804
O  -2.418645 1.646407 -2.37756
C  0.405099 0.27195 0.71345
C  -0.698439 0.580475 -0.317668
C  1.540687 -0.615963 0.338932
C  2.791409 0.369838 2.32254
C  2.725125 -0.592872 1.144882
C  1.41522 0.503428 3.011573
C  0.336808 0.783334 1.981844
C  -1.044651 2.083535 -0.359931
C  1.487031 -1.498417 -0.77363
C  3.813725 -1.425958 0.810847
C  -1.959805 -0.229605 0.012317
C  2.583994 -2.326485 -1.096988
C  3.754993 -2.290124 -0.307908
C  -1.950334 2.432631 -1.524477
C  -3.06483 -2.401052 -0.316848
C  -4.143329 -2.161027 -1.376272
H  -0.364552 0.267243 -1.319916
H  3.561898 0.045541 3.045526
H  3.097617 1.372055 1.953231
H  1.17081 -0.434085 3.557536
H  1.441538 1.309114 3.768233
H  -0.530751 1.3788 2.291862
H  -1.558512 2.396912 0.566569
H  -0.123575 2.689362 -0.435704
H  0.570931 -1.573163 -1.367924
H  4.717838 -1.397774 1.431562
H  2.519915 -3.002846 -1.956538
H  4.608857 -2.931147 -0.554125
H  -2.628793 -3.41054 -0.383857
H  -3.448238 -2.21598 0.701933
H  -4.969271 -2.883281 -1.237059
H  -4.554542 -1.141564 -1.291373
H  -3.733232 -2.292097 -2.392129
H  -2.820813 4.006575 -2.322897
