program: Gaussian 09
title: 000287598
version: EM64L-G09RevD.01
frameworkgroup: C1[X(C19H24O3)]
method: RPBEPBE
basis: SDD
operation: Freq
keyword: #pfreq=noraman
keyword: PBEPBE/SDD
title: #p freq=noraman PBEPBE/SDD
converged: YES YES NO NO
title: Mulliken charges:
elementType: O O O C C C C C C C C C C C C C C C C C C C H H H H H H H H H H H H H H H H H H H H H H H H
charge: -0.451048 -0.202962 -0.270405 -0.086650 -0.207846 -0.139831 -0.266794 -0.483403 -0.488667 -0.510641 -0.132547 0.126276 0.323619 -0.448050 -0.577491 -0.518585 0.332160 -0.421250 -0.556383 -0.397579 0.319715 -0.536519 0.239462 0.239007 0.228655 0.273221 0.203805 0.216635 0.219696 0.219079 0.201082 0.213149 0.208199 0.224357 0.235163 0.226815 0.222461 0.238964 0.247841 0.231688 0.334056 0.254287 0.237803 0.242205 0.217867 0.219385
chargesum: 0.00000
title: Mulliken charges with hydrogens summed into heavy atoms:
elementType: O O O C C C C C C C C C C C C C C C C C C C
charge: -0.116992 -0.202962 -0.270405 0.152813 0.031161 0.088823 0.006427 -0.062963 -0.049892 -0.096409 0.075651 0.126276 0.323619 0.011469 -0.128215 -0.031780 0.332160 -0.189562 -0.302096 -0.159777 0.319715 0.142937
polarizability: 2.82710010e+02 -4.62289928e+00 1.87109171e+02 1.97715223e+00 2.49394082e+00 1.49380577e+02
1716.lowfreq: -8.7331 -3.9310 0.0006 0.0008 0.0009 9.1633 34.8183 56.9791 62.9833
frequency: 34.8110 56.8838 62.9152 84.7213 90.9419 120.7042 143.8871 161.4687 171.6885 185.4300 201.6858 222.8341 228.8540 255.9188 260.2862 293.5042 300.5599 339.5646 350.4512 372.1369 396.9467 404.9365 421.9865 443.8293 459.4446 493.0309 500.5674 513.6890 559.5741 570.7418 579.2301 592.8876 611.4390 665.2831 699.6103 713.0809 721.2849 768.0138 788.3500 807.7617 812.7523 832.3249 840.2289 867.2097 876.8177 888.6721 906.5221 920.1417 928.1092 936.8106 959.7605 973.4345 999.8681 1003.6316 1007.3220 1036.4214 1050.0841 1060.6884 1083.4087 1090.5231 1101.2842 1104.4934 1112.1722 1131.2908 1139.1443 1141.7000 1148.3152 1151.1084 1173.6899 1179.7541 1197.9396 1202.0344 1213.4807 1224.2167 1228.1340 1241.0817 1252.8224 1263.2317 1270.0422 1284.9399 1298.4854 1299.4407 1305.1443 1318.7639 1321.8485 1322.8999 1333.9412 1341.4150 1347.1070 1354.2558 1357.2571 1366.7748 1383.1114 1392.9844 1424.1653 1436.8993 1442.1511 1453.6218 1461.4258 1461.9965 1463.8559 1464.7008 1473.5873 1479.5838 1494.7587 1580.0615 1620.6229 1624.7952 2932.5503 2941.6534 2947.7904 2954.9199 2958.7291 2964.7023 2969.2366 2975.4348 2981.3064 2987.6273 2991.1017 3008.4292 3017.8123 3021.5397 3031.5680 3039.5052 3040.6602 3065.6589 3079.6950 3111.7202 3120.2560 3138.5522 3160.6091 3560.8153
redmass: 4.5810 5.0630 3.8674 4.1951 4.2499 3.5977 3.7869 3.6531 4.2718 3.2032 2.7637 1.9437 2.1131 2.2547 2.4088 2.9041 1.0977 3.6195 3.4194 3.5086 3.7267 3.0741 3.1621 2.9636 2.8924 4.0749 3.2613 4.1313 4.2548 2.7728 4.7001 4.8658 2.9341 3.6642 2.8030 4.2973 3.2265 2.8329 2.3893 1.8508 2.2541 2.0052 2.7242 2.3647 2.3067 1.8345 2.1101 2.9306 2.8002 1.4372 2.4381 2.2614 2.8359 2.0619 2.2721 2.0743 1.8975 2.0332 1.6397 2.3715 1.8551 1.7640 1.2605 1.6389 1.9568 1.5857 1.7094 1.3214 1.4963 1.4565 1.4929 1.8007 1.3115 1.5421 1.4110 1.8687 1.7084 1.5699 1.4411 1.2340 1.4973 1.3610 1.3200 1.3672 1.4117 1.5058 1.3860 1.5713 1.4465 1.5103 1.5623 1.7157 5.0282 1.6202 2.9979 1.2872 1.0919 1.1147 1.0891 1.0880 1.0925 1.0504 1.0742 1.0925 2.5777 7.1976 9.5860 7.0237 1.0800 1.0818 1.0847 1.0331 1.0639 1.0591 1.0674 1.0645 1.0769 1.0827 1.0624 1.0630 1.0953 1.0990 1.1019 1.1018 1.1037 1.1004 1.1002 1.0888 1.0991 1.0913 1.0935 1.0660
irintensity: 0.8680 2.1986 0.2418 2.0753 5.7823 2.4573 2.1911 2.9262 4.1297 1.3002 0.2463 1.5539 0.0895 1.8930 6.9494 2.1594 166.5658 7.8008 3.1038 0.7642 2.3213 3.0847 12.2542 4.9309 4.1138 9.1550 10.4618 6.1210 3.8591 4.7459 6.1167 6.3037 1.9910 5.8074 0.9045 3.4028 1.1328 3.0480 7.8283 26.2367 13.8672 1.9815 0.2942 3.5346 10.4247 7.2201 25.4559 32.4984 20.1713 3.0438 24.2094 12.2859 20.7712 27.7910 27.3934 4.9345 7.5725 1.6501 14.6939 1.3815 25.4616 35.5266 0.2635 22.5758 8.2711 14.2619 13.8673 7.7252 46.5388 0.0725 31.1104 40.6827 2.9089 3.1542 0.6244 62.5696 50.7934 54.9826 12.6290 6.7216 3.2901 18.5752 0.9173 1.1163 1.6882 5.1621 0.9450 2.5005 1.3936 1.4683 7.0316 3.1016 7.1415 6.8561 27.0813 1.4403 19.2295 8.5698 3.0185 23.3997 6.8316 12.4564 48.3573 9.8695 108.0454 18.9429 102.8992 96.3245 19.6354 35.6733 40.4134 78.4809 26.5952 43.6437 30.2873 19.8196 16.6041 12.7228 9.8803 47.0206 40.4528 44.2614 50.8914 43.5980 55.3151 33.4965 18.2581 22.1939 25.2858 7.0876 16.7448 5.0045
temp: 298.150 k
press: 1.00000 atm
elementType: 8 8 8 6 6 6 6 6 6 6 6 6 6 6 6 6 6 6 6 6 6 6 1 1 1 1 1 1 1 1 1 1 1 1 1 1 1 1 1 1 1 1 1 1 1 1
symmnumber: 1
zpe: 1023489.4 jmol-1
zpe.correction: 0.389827 hartree
zpe.thermalcorrener: 0.409443 hartree
zpe.thermalcorrenthalpy: 0.410387 hartree
zpe.thermalcorrgfe: 0.342712 hartree
zpe.sumelectzpe: -962.440204 hartree
zpe.sumelectthermal: -962.420588 hartree
zpe.sumelectthermalent: -962.419644 hartree
zpe.sumelectthermalfe: -962.487318 hartree
dipole: -0.3818 -0.1259 -3.5730
dipole: 3.5956
quadrupole: -121.7754 -123.3896 -136.5682
quadrupole: -9.5021 6.2228 3.5548
quadrupole: 5.4690 3.8548 -9.3238 -9.5021 6.2228 3.5548
hfenergy: -962.8300308 hartree
pointgroup: C01 [X(C19H24O3)]
dipole: -0.1438026 -0.0248637 -1.4070618 debye
polarizability: 282.5789632|-5.6842106|187.1267281|2.5676639|3.064597|149.4940669 unknown
InChI: InChI=1S/C19H24O3/c1-22-12-3-5-13-11(10-12)2-4-15-14(13)6-7-16-17(20)8-9-18(21)19(15)16/h3,5,10,14-17,19-20H,2,4,6-9H2,1H3
charge 0 multiplicity 1
46 atoms
O  -4.909474 1.341862 -0.844485
O  -2.199157 -1.105569 2.267403
O  5.771865 0.255442 0.007846
C  -0.727683 0.675154 0.581013
C  -2.262324 0.527812 0.424332
C  -2.69981 0.199439 -1.041359
C  0.043247 -0.532568 -0.027695
C  -1.94764 -1.047663 -1.567782
C  -0.419884 -0.84077 -1.484778
C  -0.192822 2.00595 -0.002561
C  -4.236945 0.058859 -1.158459
C  -2.879518 -0.485459 1.404589
C  1.557793 -0.320491 0.018784
C  -4.82382 -0.963762 -0.173636
C  1.281102 2.210302 0.406763
C  -4.389812 -0.664739 1.286803
C  2.143052 0.971354 0.17396
C  2.418948 -1.433853 -0.12675
C  3.548761 1.106647 0.159772
C  3.824604 -1.308628 -0.135342
C  4.390549 -0.01758 0.004735
C  6.680399 -0.881212 -0.14401
H  -0.514347 0.679369 1.669826
H  -2.745342 1.497435 0.683534
H  -2.394432 1.058802 -1.679161
H  -0.203329 -1.421389 0.587736
H  -2.247978 -1.252822 -2.615119
H  -2.225733 -1.940959 -0.97211
H  0.10754 -1.742959 -1.84839
H  -0.117238 -0.013342 -2.157852
H  -0.80038 2.854457 0.370151
H  -0.275096 2.010784 -1.107395
H  -4.489438 -0.243916 -2.199177
H  -4.499359 -1.978854 -0.46854
H  -5.925437 -0.936123 -0.248703
H  1.316849 2.464102 1.487094
H  1.717473 3.075609 -0.12826
H  -4.71532 -1.460561 1.977986
H  -4.870977 0.285432 1.593491
H  1.978115 -2.434172 -0.227028
H  -4.590202 2.031578 -1.479995
H  4.015787 2.091149 0.276583
H  4.450712 -2.199128 -0.244061
H  7.691203 -0.447868 -0.115603
H  6.52378 -1.398209 -1.111302
H  6.563315 -1.607143 0.684652
