program: Gaussian 09
title: 000287602
version: EM64L-G09RevD.01
frameworkgroup: C1[X(C19H20O3)]
method: RPBEPBE
basis: SDD
operation: Freq
keyword: #pfreq=noraman
keyword: PBEPBE/SDD
title: #p freq=noraman PBEPBE/SDD
converged: YES YES NO NO
title: Mulliken charges:
elementType: O O O C C C C C C C C C C C C C C C C C C C H H H H H H H H H H H H H H H H H H H H
charge: -0.177292 -0.183464 -0.263991 -0.250643 -0.238499 -0.213215 0.350259 -0.474978 -0.486279 0.113282 -0.392357 0.140837 -0.586297 0.119071 -0.521966 -0.513984 0.361712 -0.367175 -0.558502 -0.398027 0.319113 -0.535633 0.284687 0.241458 0.248359 0.236343 0.224467 0.220831 0.246791 0.204001 0.220739 0.233064 0.242712 0.256031 0.238649 0.257415 0.220827 0.255212 0.240100 0.220914 0.220872 0.244557
chargesum: 0.00000
title: Mulliken charges with hydrogens summed into heavy atoms:
elementType: O O O C C C C C C C C C C C C C C C C C C C
charge: -0.177292 -0.183464 -0.263991 0.034044 0.002959 0.035144 0.350259 -0.014167 -0.018657 0.113282 -0.188356 0.140837 -0.132494 0.119071 -0.023223 -0.017921 0.361712 -0.146348 -0.303291 -0.157927 0.319113 0.150710
polarizability: 2.93999820e+02 6.33313911e-01 2.04558210e+02 1.40363264e+01 9.39131395e+00 1.41379703e+02
1716.lowfreq: -10.1333 -4.9990 0.0003 0.0006 0.0008 4.8235 14.4818 45.2764 61.8797
frequency: 14.3736 45.2512 61.8700 68.9954 83.2855 104.7792 131.6326 151.0266 164.6285 190.5440 221.5085 230.7568 250.5149 267.8381 283.6097 295.4443 323.9658 354.1789 378.0548 400.6329 413.4834 437.2683 448.3502 470.7891 501.4054 515.1095 540.4030 556.8920 559.6442 581.6166 610.1231 638.8653 675.8945 708.2833 714.3829 735.2535 737.6007 772.1573 797.1631 806.5129 825.9407 854.8670 868.0405 874.2995 895.0699 916.5535 937.9244 940.4853 961.9443 971.9122 991.7481 1006.5316 1017.8415 1029.7017 1057.3587 1075.1780 1088.8264 1101.8444 1111.7251 1124.8279 1138.3436 1144.0385 1146.3820 1156.4302 1179.3813 1185.7042 1212.9627 1214.2805 1229.5253 1235.2143 1240.9584 1256.1111 1261.2818 1268.0420 1277.2306 1280.4235 1290.4940 1328.2035 1329.7755 1330.3804 1335.0557 1348.9856 1351.2242 1366.8890 1380.4319 1432.6841 1438.2511 1441.3415 1451.0919 1454.8457 1456.0313 1466.7427 1468.1749 1474.4894 1492.5088 1569.9042 1621.7746 1627.1747 1634.0755 1660.6954 2926.1919 2944.7348 2955.9861 2959.2467 2964.4537 2978.5716 2985.6150 2986.5238 3008.5406 3017.9770 3030.4990 3046.7352 3047.3818 3076.5090 3080.5201 3111.1640 3124.1077 3138.7349 3141.9884 3164.0801
redmass: 4.2706 5.7710 5.0102 7.6411 3.7674 4.1964 3.5751 3.0429 3.1402 3.1732 2.7254 1.3101 2.7719 3.3812 2.4549 4.0725 5.4099 3.6709 3.8092 3.4569 4.0833 3.3855 3.6936 4.6549 3.2976 4.9473 4.0346 4.1169 3.7102 4.2031 3.7669 2.8036 4.2152 5.6179 2.6628 2.9124 4.1840 2.2773 3.1009 1.5102 1.6410 2.1559 2.3472 3.1768 1.6343 2.5247 1.4932 2.3104 2.2484 2.4090 2.6956 3.4416 2.3397 2.6833 2.3164 2.3002 2.2849 1.7971 1.2602 1.7284 1.6828 2.2785 1.4559 1.4671 1.4816 1.5784 1.3423 1.3289 1.5923 1.7014 1.4944 1.8571 1.6833 2.1926 1.3378 1.4939 1.3294 1.5489 1.4245 1.4661 1.6813 1.6691 1.5266 1.9627 4.1465 2.2251 1.4429 1.1455 1.0759 1.0907 1.1234 1.0508 1.0943 1.0830 2.5177 6.9659 6.5277 9.6872 9.9700 7.3407 1.0807 1.0772 1.0665 1.0330 1.0664 1.0670 1.0616 1.0629 1.0962 1.0852 1.0929 1.1039 1.1032 1.0939 1.0987 1.0899 1.0993 1.0868 1.0912 1.0951
irintensity: 0.1305 0.1491 0.5247 10.5627 5.0663 3.6237 0.9135 0.6728 1.2245 0.9890 1.4910 0.2099 1.8341 5.9832 1.7120 4.1460 4.7630 0.8223 0.0871 2.0500 11.3594 3.7724 2.4230 6.2963 1.3831 1.4096 6.5475 5.6601 0.5128 9.5989 5.0815 1.8030 1.8767 4.8494 5.6838 1.4302 2.2566 5.0087 23.8331 33.6211 3.6502 5.8996 5.8609 4.2204 25.3912 9.3480 1.3014 0.1644 8.7679 7.5639 30.9860 44.3069 1.1608 21.7199 0.2258 5.0706 2.5985 12.3912 0.2877 25.6537 39.7477 49.2724 18.0519 15.1921 36.4866 11.4977 7.6656 6.2621 28.6286 30.2706 37.9372 52.2060 16.4722 101.4148 8.3016 6.8213 7.7694 6.5396 4.9728 5.0986 3.2226 8.0723 4.4936 2.2580 16.9111 21.2027 0.4964 15.8721 14.0795 19.8143 21.8972 14.0845 5.9547 54.7823 83.1376 27.5663 109.3965 185.7693 95.3380 14.0288 17.7626 17.1180 25.8584 81.8180 50.5333 12.0777 19.7544 22.3922 3.9508 16.8633 32.4909 44.3609 43.1280 22.5825 10.5739 28.3438 28.0531 11.1939 3.8390 18.8398
temp: 298.150 k
press: 1.00000 atm
elementType: 8 8 8 6 6 6 6 6 6 6 6 6 6 6 6 6 6 6 6 6 6 6 1 1 1 1 1 1 1 1 1 1 1 1 1 1 1 1 1 1 1 1
symmnumber: 1
zpe: 901767.8 jmol-1
zpe.correction: 0.343465 hartree
zpe.thermalcorrener: 0.362488 hartree
zpe.thermalcorrenthalpy: 0.363432 hartree
zpe.thermalcorrgfe: 0.295431 hartree
zpe.sumelectzpe: -960.079662 hartree
zpe.sumelectthermal: -960.060639 hartree
zpe.sumelectthermalent: -960.059695 hartree
zpe.sumelectthermalfe: -960.127696 hartree
dipole: 1.1859 -1.2337 0.0649
dipole: 1.7124
quadrupole: -111.5622 -135.4537 -132.2210
quadrupole: -3.7658 -3.8267 12.4327
quadrupole: 14.8501 -9.0414 -5.8087 -3.7658 -3.8267 12.4327
hfenergy: -960.4231269 hartree
pointgroup: C01 [X(C19H20O3)]
dipole: -0.4612495 0.4910411 0.0051456 debye
polarizability: 293.8118246|-1.0885379|203.5311314|-15.096586|-12.1992745|142.5947764 unknown
InChI: InChI=1S/C19H20O3/c1-22-12-3-5-13-11(10-12)2-4-15-14(13)6-7-16-17(20)8-9-18(21)19(15)16/h3,5-6,10,15-16,19H,2,4,7-9H2,1H3
charge 0 multiplicity 1
42 atoms
O  3.853211 -2.366802 -0.853904
O  2.840922 2.418907 1.327818
O  -5.55979 -0.46409 0.531814
C  2.367139 -0.42234 -0.812575
C  0.971475 -0.56996 -0.13029
C  2.904898 1.043499 -0.714005
C  0.005515 0.545521 -0.546958
C  0.355156 -1.95507 -0.458825
C  1.922844 2.033305 -1.366734
C  3.390019 -1.38856 -0.209229
C  0.469079 1.686585 -1.138619
C  3.25902 1.386306 0.744237
C  -0.962336 -2.153381 0.309086
C  -1.443395 0.309187 -0.268533
C  3.827916 -1.086671 1.226494
C  4.220767 0.407185 1.426086
C  -1.920728 -0.98285 0.128324
C  -2.398871 1.358817 -0.357606
C  -3.293113 -1.185569 0.376734
C  -3.769929 1.162442 -0.107407
C  -4.223817 -0.129899 0.258598
C  -6.560212 0.599001 0.413562
H  2.253024 -0.67904 -1.883251
H  1.097001 -0.513462 0.974533
H  3.872273 1.073467 -1.262729
H  1.067766 -2.762477 -0.205558
H  0.172538 -2.014884 -1.549886
H  2.125944 2.095995 -2.456172
H  2.115695 3.044444 -0.954929
H  -0.242867 2.449268 -1.479066
H  -0.735962 -2.269062 1.39035
H  -1.453935 -3.093173 -0.004492
H  2.982617 -1.326871 1.902367
H  4.663399 -1.756142 1.491051
H  5.224019 0.572781 0.981105
H  4.288905 0.661433 2.497102
H  -2.066735 2.371435 -0.608063
H  -3.664187 -2.17424 0.66856
H  -4.459438 2.008008 -0.187239
H  -6.593751 1.008701 -0.61487
H  -6.365323 1.418545 1.132614
H  -7.520054 0.117912 0.6524
