program: Gaussian 09
title: 000287583
version: EM64L-G09RevD.01
frameworkgroup: C1[X(C11H14O3)]
method: RPBEPBE
basis: SDD
operation: Freq
keyword: #pfreq=noraman
keyword: PBEPBE/SDD
title: #p freq=noraman PBEPBE/SDD
converged: YES YES NO NO
title: Mulliken charges:
elementType: O O O C C C C C C C C C C C H H H H H H H H H H H H H H
charge: -0.273050 -0.417256 -0.237262 -0.567609 -0.382174 0.529496 -0.491403 -0.536392 -0.444442 0.340956 -0.215673 -0.381998 0.195727 -0.537396 0.195657 0.244404 0.221080 0.236792 0.246818 0.259853 0.267427 0.230405 0.218442 0.240526 0.219444 0.218944 0.243729 0.374952
chargesum: 0.00000
title: Mulliken charges with hydrogens summed into heavy atoms:
elementType: O O O C C C C C C C C C C C
charge: -0.273050 -0.042304 -0.237262 -0.127547 0.075699 0.529496 0.015268 -0.268965 -0.214037 0.340956 0.002769 -0.141472 0.195727 0.144722
polarizability: 1.72862598e+02 9.97849566e+00 1.33614640e+02 -7.61398282e+00 2.21262071e+00 7.59275966e+01
1716.lowfreq: -16.5492 -4.5091 -0.0010 -0.0009 -0.0007 7.7013 19.4573 27.1187 32.3540
frequency: 12.8812 27.0616 32.2543 67.9919 98.0527 113.2207 201.2535 212.3705 229.2899 261.2137 266.8416 282.2665 327.0665 441.5505 452.4219 465.6784 496.7833 540.3401 556.8680 581.3627 629.5590 643.4255 698.9502 725.9187 750.4955 782.5287 821.9364 852.8820 874.0403 897.3601 903.6520 963.3206 981.3179 997.9629 1015.5918 1033.4662 1048.8254 1082.8651 1098.5669 1112.6679 1144.5289 1158.7667 1165.9108 1185.2427 1207.4389 1249.6276 1256.4735 1278.1130 1297.2619 1305.9523 1348.4201 1365.2549 1388.7519 1432.6811 1434.7118 1448.3148 1461.9399 1467.1044 1475.1317 1476.9227 1484.2680 1588.4067 1619.9460 1667.5189 2956.3553 2983.6832 2991.2771 3002.7087 3039.4620 3042.6509 3047.5246 3070.6122 3120.4888 3122.5008 3141.3345 3146.9025 3165.8290 3511.3539
redmass: 3.7768 5.3269 8.6596 3.3784 4.1679 3.8609 1.7339 2.4858 2.6444 3.7295 1.8810 2.9667 2.8748 4.1455 3.1742 4.0950 1.9007 4.3277 4.6182 3.8739 4.0503 1.3846 2.1974 3.4561 1.6526 1.6482 2.3678 2.1181 1.4481 2.5366 1.8661 1.3239 5.4831 2.3993 3.4840 2.5023 2.6549 1.8009 1.7036 1.2606 1.5619 1.3069 1.3846 1.2379 1.2588 1.9519 2.1372 1.3299 1.3545 1.2606 1.4687 1.7903 8.1082 1.3056 1.1082 2.1364 1.0925 1.0501 1.0929 2.3587 1.1137 6.1258 6.6537 7.9916 1.0331 1.0609 1.0614 1.0621 1.0983 1.1038 1.0976 1.1036 1.0865 1.0989 1.0931 1.0923 1.0962 1.0639
irintensity: 0.2658 0.3843 1.1312 4.9922 2.9663 0.9257 0.6662 1.6152 3.3739 1.3732 1.3104 0.9748 0.1357 0.0884 12.0425 27.1483 29.3169 6.7995 8.3113 6.9181 1.7137 130.6661 24.4928 23.2302 8.3995 48.5601 1.4325 8.7768 0.7068 3.9495 17.1383 0.2140 4.0666 21.6730 125.5968 160.3579 64.5569 56.2856 14.8835 0.2706 21.5631 30.7541 41.8816 5.4798 4.6661 60.1359 43.6898 20.5310 5.0990 1.2880 3.2877 47.1338 5.2128 47.5840 17.2574 21.8010 4.4609 12.7902 22.6893 52.2440 9.2500 58.3131 94.3870 181.8956 70.9754 19.5588 30.4192 24.0488 2.3352 51.8054 10.3230 30.8565 6.1760 26.8458 26.1928 2.1274 16.5156 21.6267
temp: 298.150 k
press: 1.00000 atm
elementType: 8 8 8 6 6 6 6 6 6 6 6 6 6 6 1 1 1 1 1 1 1 1 1 1 1 1 1 1
symmnumber: 1
zpe: 597136.8 jmol-1
zpe.correction: 0.227437 hartree
zpe.thermalcorrener: 0.241638 hartree
zpe.thermalcorrenthalpy: 0.242582 hartree
zpe.thermalcorrgfe: 0.183168 hartree
zpe.sumelectzpe: -652.183932 hartree
zpe.sumelectthermal: -652.169732 hartree
zpe.sumelectthermalent: -652.168787 hartree
zpe.sumelectthermalfe: -652.228201 hartree
dipole: -0.4895 1.4793 0.6631
dipole: 1.6934
quadrupole: -59.7886 -82.1692 -84.5005
quadrupole: 1.0073 -2.7155 0.4426
quadrupole: 15.6975 -6.6831 -9.0144 1.0073 -2.7155 0.4426
hfenergy: -652.4113696 hartree
pointgroup: C01 [X(C11H14O3)]
dipole: 0.1899296 0.5819027 -0.2630214 debye
polarizability: 172.8164918|-9.9251768|133.5655743|-8.125325|-2.2807344|76.0227689 unknown
InChI: InChI=1S/C11H14O3/c1-14-10-6-2-4-9(8-10)5-3-7-11(12)13/h2,4,6,8,12H,3,5,7H2,1H3
charge 0 multiplicity 1
28 atoms
O  3.141454 -1.70823 -0.054408
O  -5.263142 -0.547231 0.272563
O  -3.253253 -1.705734 0.262617
C  -1.079041 0.752808 0.545551
C  -1.827799 0.616557 -0.81009
C  0.431446 0.770599 0.360815
C  -3.361305 0.601105 -0.657617
C  1.146873 -0.442095 0.249087
C  1.140116 1.998592 0.25411
C  2.546928 -0.437115 0.034484
C  2.534061 1.998857 0.04034
C  3.253924 0.786344 -0.072587
C  -3.889914 -0.663087 -0.004345
C  4.588278 -1.764228 -0.267319
H  -1.409536 1.684866 1.045313
H  -1.371338 -0.094348 1.192962
H  -1.542438 1.458735 -1.468932
H  -1.496615 -0.312171 -1.310096
H  -3.721489 1.467958 -0.071148
H  -3.854832 0.682716 -1.646564
H  0.634459 -1.407055 0.331873
H  0.598325 2.947443 0.345732
H  3.074671 2.949395 -0.035933
H  4.335577 0.807885 -0.234922
H  5.138547 -1.283621 0.565449
H  4.8753 -1.285714 -1.224397
H  4.832202 -2.836308 -0.302041
H  -5.585556 -1.396823 0.680303
