program: Gaussian 09
title: 000287605
version: EM64L-G09RevD.01
frameworkgroup: C1[X(C21H20O5)]
method: RPBEPBE
basis: SDD
operation: Freq
keyword: #pfreq=noraman
keyword: PBEPBE/SDD
title: #p freq=noraman PBEPBE/SDD
converged: NO YES NO NO
title: Mulliken charges:
elementType: O O O O O C C C C C C C C C C C C C C C C C C C C C H H H H H H H H H H H H H H H H H H H H
charge: -0.172876 -0.258603 -0.254613 -0.258174 -0.257291 0.180197 0.219877 0.179109 0.193477 -0.251925 0.307310 -0.693868 -0.360038 -0.556598 0.325070 -0.373562 -0.386213 -0.404388 0.294387 -0.375860 -0.378810 0.318367 -0.268048 -0.535760 -0.659614 -0.537132 0.258118 0.281301 0.265098 0.290716 0.252509 0.311290 0.256541 0.256280 0.243043 0.222889 0.231684 0.246718 0.226999 0.226425 0.212668 0.250988 0.235454 0.224152 0.223614 0.249093
chargesum: 0.00000
title: Mulliken charges with hydrogens summed into heavy atoms:
elementType: O O O O O C C C C C C C C C C C C C C C C C C C C C
charge: -0.172876 -0.258603 -0.254613 -0.258174 -0.257291 0.180197 0.219877 0.179109 0.193477 -0.251925 0.307310 -0.154449 -0.094940 -0.265882 0.325070 -0.121054 -0.074923 -0.147847 0.294387 -0.119580 -0.135767 0.318367 0.186524 0.164382 0.039496 0.159728
polarizability: 3.99336702e+02 -2.09629430e+01 3.05666818e+02 -9.90631038e+00 1.56725546e+01 1.43286561e+02
1716.lowfreq: -5.6395 -3.0710 0.0005 0.0006 0.0008 1.6731 18.2723 34.6274 37.0771
frequency: 18.2078 34.6163 37.0685 43.4831 47.8325 62.3975 76.7181 85.3620 97.2345 106.8572 132.1652 149.5858 154.1296 160.1795 182.6247 190.4429 209.4601 219.3959 234.2896 245.9702 262.1525 280.1946 306.0072 317.2524 321.0028 343.8401 365.2900 418.3656 424.1058 426.8877 443.3502 458.4661 490.4707 507.5366 531.0259 542.5638 569.9295 582.1783 622.6914 627.5981 648.8782 672.9485 693.5336 712.5209 738.6325 751.8856 765.6709 780.5651 812.0862 818.3249 826.9076 833.7322 840.7162 859.0404 886.6325 900.7583 918.2174 948.5832 957.4000 962.9936 967.8133 983.4239 993.6761 1002.1945 1005.2928 1017.0539 1067.7224 1095.8440 1111.7988 1112.3290 1113.7435 1120.0789 1142.9361 1154.0709 1156.9736 1158.4198 1170.0125 1182.2493 1189.1747 1232.4339 1240.3795 1253.6907 1271.4302 1276.9630 1311.3416 1317.2829 1343.1306 1354.5682 1370.7925 1387.4331 1392.1672 1426.6714 1428.0233 1431.8386 1437.1624 1456.5652 1458.3989 1462.2708 1467.0979 1468.7433 1469.9810 1472.3067 1475.6373 1484.5597 1500.0836 1558.7624 1577.2279 1593.9626 1604.1746 1621.3805 1628.1908 1629.7627 2964.4345 2965.0689 2994.3707 2994.5258 3027.7159 3054.5348 3055.6080 3074.0015 3089.9902 3094.5473 3120.3762 3128.5034 3129.4667 3133.2408 3138.6979 3146.3146 3160.1302 3164.3159 3167.9836 3171.0666
redmass: 4.4681 3.7201 4.4743 6.8296 4.1633 3.9949 4.4727 4.1272 4.2623 3.7786 4.4969 4.6941 4.3035 4.1235 3.3385 2.7971 1.6348 1.5406 1.2636 3.1479 2.5520 2.7068 3.9581 3.9455 4.5356 5.9113 6.3786 3.2065 3.2551 3.2630 4.4222 4.3108 4.8177 4.0336 5.0928 3.6429 6.4023 4.1541 6.1049 4.9907 4.0107 5.5351 4.4927 5.0429 5.0587 4.4037 5.9318 3.2861 1.5124 1.5518 2.8063 3.3293 1.6388 1.5148 2.6634 2.2546 5.3883 1.4304 2.0131 1.9282 3.4399 7.9620 3.1406 2.3807 1.4249 3.0035 2.9472 2.2102 1.2600 1.2582 2.2430 1.4399 1.7203 1.4423 1.6510 1.3820 2.5403 1.6176 1.8193 4.3833 2.5776 1.5743 1.5465 1.1224 1.4138 1.4908 3.4905 1.3412 4.9195 5.2744 1.2299 2.0496 1.4733 1.4363 1.1856 1.0971 3.2641 1.0429 1.0523 1.0499 1.4786 1.0820 1.5555 1.0527 2.5879 6.9618 9.0497 8.1197 8.3997 7.0315 8.5533 8.5335 1.0328 1.0327 1.0487 1.0492 1.0597 1.1042 1.1043 1.0974 1.0975 1.1032 1.1056 1.0999 1.0995 1.0922 1.0884 1.0889 1.0916 1.0948 1.0953 1.0955
irintensity: 1.3422 0.1085 1.6216 1.5458 0.2945 1.4587 3.2667 1.5918 2.8550 4.6193 3.7256 0.7904 0.7406 1.8700 3.9573 3.7484 3.9677 1.4285 0.2133 6.8875 1.8468 4.7624 4.9562 9.6339 3.8181 0.6666 3.3362 7.4572 10.4572 2.3945 0.0371 3.2380 28.4795 19.3618 3.0308 1.6222 33.1860 7.2023 2.5418 9.2708 8.2642 1.9300 3.9281 3.9237 6.9164 17.9539 13.8994 2.7057 11.7405 30.3705 2.4537 25.8440 23.0654 51.8056 22.4751 8.8155 6.7677 0.2392 4.9552 39.8833 51.4100 62.7318 16.8626 16.5942 3.2313 84.3189 6.5527 85.1455 0.2603 0.1638 245.6330 41.3737 37.1998 5.9669 10.4240 6.8907 127.2764 222.2606 52.2395 214.6786 218.5402 6.6783 32.3147 5.9221 46.8708 76.1389 191.6114 6.9604 127.1930 20.4256 20.3249 57.6665 50.7351 23.6325 9.8841 13.6126 60.1992 14.9759 16.5582 13.3321 161.0748 44.5183 7.3615 13.1692 65.6263 53.9653 179.9065 19.6325 333.1736 43.6654 47.9361 139.4384 98.2421 56.1876 15.8488 14.1063 36.5520 43.6651 43.4404 0.6226 37.7442 0.8741 34.9442 29.1169 28.4059 14.6242 10.1204 2.3939 4.5354 9.1817 12.9652 10.3242
temp: 298.150 k
press: 1.00000 atm
elementType: 8 8 8 8 8 6 6 6 6 6 6 6 6 6 6 6 6 6 6 6 6 6 6 6 6 6 1 1 1 1 1 1 1 1 1 1 1 1 1 1 1 1 1 1 1 1
symmnumber: 1
zpe: 942556.1 jmol-1
zpe.correction: 0.359001 hartree
zpe.thermalcorrener: 0.383803 hartree
zpe.thermalcorrenthalpy: 0.384747 hartree
zpe.thermalcorrgfe: 0.302396 hartree
zpe.sumelectzpe: -1186.466739 hartree
zpe.sumelectthermal: -1186.441937 hartree
zpe.sumelectthermalent: -1186.440993 hartree
zpe.sumelectthermalfe: -1186.523343 hartree
dipole: 1.5222 -2.6573 0.6295
dipole: 3.1264
quadrupole: -122.7675 -126.5243 -157.5325
quadrupole: -7.3292 6.9177 -6.3729
quadrupole: 12.8406 9.0838 -21.9244 -7.3292 6.9177 -6.3729
hfenergy: -1186.8257398 hartree
pointgroup: C01 [X(C21H20O5)]
dipole: -0.089625 1.1922244 0.2890567 debye
polarizability: 364.7011346|-49.4808648|341.1816535|6.7857433|-12.6289675|142.4072924 unknown
InChI: InChI=1S/C21H20O5/c1-4-26-19(22)12-18-20(13-5-7-14(24-2)8-6-13)16-10-9-15(25-3)11-17(16)21(18)23/h5-11H,4,12H2,1-3H3
charge 0 multiplicity 1
46 atoms
O  1.369459 -2.858996 1.185486
O  5.514665 0.639075 -0.262162
O  -2.418347 -3.959253 0.50156
O  -4.418624 4.023507 -0.219312
O  -2.281066 -2.319847 -1.148519
C  -0.145694 0.273232 0.382474
C  1.312135 0.585896 0.18187
C  -0.270366 -1.060925 0.758149
C  2.065164 -0.585167 0.458018
C  1.091005 -1.672508 0.842493
C  -1.224886 1.259945 0.219216
C  -1.491306 -1.843172 1.15901
C  1.980639 1.740399 -0.266058
C  3.455128 -0.64574 0.332688
C  4.127108 0.538442 -0.09644
C  3.392047 1.711765 -0.396808
C  -2.45777 0.913268 -0.415994
C  -1.07303 2.590082 0.70277
C  -2.080952 -2.695234 0.031653
C  -3.48965 1.854361 -0.548507
C  -2.109589 3.538431 0.591456
C  -3.325389 3.169369 -0.040235
C  -3.006995 -4.914043 -0.492057
C  6.321231 -0.553507 0.018606
C  -1.897632 -5.646034 -1.251466
C  -4.300357 5.398794 0.275622
H  -2.292133 -1.156112 1.495607
H  -1.24445 -2.521401 1.99324
H  1.434864 2.650097 -0.534871
H  3.981677 -1.578944 0.553181
H  3.94489 2.591679 -0.73914
H  -2.571684 -0.086777 -0.849714
H  -0.148573 2.87294 1.217723
H  -4.427736 1.600047 -1.050767
H  -1.964211 4.544407 0.996155
H  -3.604312 -5.596908 0.132832
H  -3.66162 -4.34799 -1.178173
H  7.359614 -0.248248 -0.175621
H  6.0465 -1.391063 -0.650894
H  6.215789 -0.870352 1.073956
H  -2.340865 -6.417646 -1.908219
H  -1.324259 -4.944852 -1.880343
H  -1.204913 -6.142291 -0.550573
H  -3.473345 5.936368 -0.226951
H  -4.147404 5.4189 1.371872
H  -5.259056 5.875703 0.025786
