program: Gaussian 09
title: 000287575
version: EM64L-G09RevD.01
frameworkgroup: C1[X(C7H12OS)]
method: RPBEPBE
basis: SDD
operation: Freq
keyword: #p
keyword: freq=noraman
keyword: PBEPBE/SDD
title: #p freq=noraman PBEPBE/SDD
converged: YES YES NO NO
title: Mulliken charges:
elementType: S O C C C C C C C H H H H H H H H H H H H
charge: 0.188857 -0.206573 -0.333597 -0.477694 -0.686530 0.223116 -0.766477 -0.281831 -0.513233 0.229992 0.244481 0.231891 0.227115 0.256338 0.255312 0.230804 0.242142 0.258652 0.231088 0.218041 0.228105
chargesum: 0.00000
title: Mulliken charges with hydrogens summed into heavy atoms:
elementType: S O C C C C C C C
charge: 0.188857 -0.206573 0.140876 -0.018688 -0.174879 0.223116 -0.034879 -0.050744 -0.067087
polarizability: 1.51816131e+02 -1.29954390e+00 8.61051860e+01 8.28061176e-01 9.58442871e-01 5.67300660e+01
1716.lowfreq: -15.1356 -9.3010 -0.0011 0.0016 0.0026 2.8362 9.9398 27.9541 41.9094
frequency: -13.5240 27.9512 41.8733 67.2355 74.3862 99.6382 118.4084 152.5609 229.0140 303.1699 393.2054 416.5117 461.7228 566.3409 577.2043 665.9049 699.3319 729.5242 801.9219 833.7483 884.4736 936.8353 944.3109 948.9068 1023.7772 1041.8624 1061.3733 1071.1955 1134.5079 1167.2404 1236.0895 1251.0600 1270.3610 1287.0037 1306.0630 1356.3439 1368.4473 1394.4339 1431.3794 1443.7022 1452.0852 1456.8906 1474.8691 1602.5811 1638.6329 2955.6760 2980.8155 3001.4610 3004.8870 3013.5737 3061.3990 3067.6309 3088.3753 3098.5952 3120.3040 3127.1857 3209.7297
redmass: 1.7928 5.8030 2.6567 4.2200 2.5382 1.1943 1.7509 5.3548 4.7638 3.9063 3.5727 2.9888 2.1252 1.5427 4.2040 4.3558 5.8004 1.1507 1.2966 3.3367 1.3817 1.4762 1.1096 1.6090 1.4683 1.3608 3.5393 2.5386 1.3986 2.0678 1.3031 1.2676 1.2416 1.0962 1.4637 1.6389 1.2368 1.1968 1.0939 1.0652 1.0859 1.0580 1.0883 4.1711 7.8698 1.0612 1.0383 1.0586 1.0939 1.0600 1.1042 1.0950 1.1072 1.0584 1.1005 1.0961 1.1151
irintensity: 0.0912 0.3504 0.1653 0.6945 0.7626 0.3656 0.0593 2.8158 1.3118 5.3462 7.6035 5.6159 1.7155 17.5191 5.5732 33.5821 0.9464 9.4301 2.4137 4.4557 61.7116 12.6396 47.8104 3.7790 25.5281 6.7570 0.5139 0.9435 0.2336 59.6614 8.9329 1.1412 36.1686 6.2266 96.7378 6.1911 61.5506 8.2766 21.5878 20.9357 6.1870 18.7132 11.8966 91.4586 105.5344 17.9547 4.9955 11.4161 15.5091 20.3424 0.2092 14.1987 42.8814 3.1899 13.7741 8.6666 13.6464
temp: 298.150 k
press: 1.00000 atm
elementType: 16 8 6 6 6 6 6 6 6 1 1 1 1 1 1 1 1 1 1 1 1
symmnumber: 1
zpe: 449638.7 jmol-1
zpe.correction: 0.171258 hartree
zpe.thermalcorrener: 0.182602 hartree
zpe.thermalcorrenthalpy: 0.183547 hartree
zpe.thermalcorrgfe: 0.131633 hartree
zpe.sumelectzpe: -746.475401 hartree
zpe.sumelectthermal: -746.464056 hartree
zpe.sumelectthermalent: -746.463112 hartree
zpe.sumelectthermalfe: -746.515026 hartree
dipole: 1.1083 -4.5085 0.1057
dipole: 4.6439
quadrupole: -61.2261 -64.8597 -64.2165
quadrupole: -7.3577 1.5773 0.8355
quadrupole: 2.2080 -1.4256 -0.7824 -7.3577 1.5773 0.8355
hfenergy: -746.6466588 hartree
pointgroup: C01 [X(C7H12O1S1)]
dipole: 0.382802 -1.7863362 0.0249922 debye
dipolederiv: -0.6909233 -0.0468154 -0.0015622 -0.3521248 -0.0381948 0.0109524 -0.0426914 0.0089135 -0.0919927 -0.6723513 -0.0277561 -0.0061408 -0.0828524 -0.8471238 0.0531909 -0.0025494 0.0446816 -0.2925204 -0.0516564 -0.0094233 -0.0017014 0.1630432 0.0167175 -0.0083814 0.0385773 0.0041493 0.1218168 -0.5024329 -0.1290203 -0.0176016 -0.390169 -0.0806317 -0.014428 -0.0724504 -0.027426 0.1758441 0.4674958 -0.1631291 -0.0254921 -0.2509586 0.0826425 -0.0117148 -0.0387809 -0.0159387 0.1808066 1.2554241 -0.0180645 0.0751497 0.12814 0.9705768 -0.0882542 0.0871658 -0.0837237 0.0888515 -0.4629401 0.2351623 -0.060573 0.2077018 -0.1642996 0.0633716 -0.1118771 0.102846 0.0084172 0.891441 0.2438068 0.0242026 0.5270201 0.111965 0.032956 0.0590047 0.034561 -0.1986993 -0.6324554 -0.054739 -0.0062338 -0.0607517 0.0663163 0.0608224 -0.0042811 0.0606762 -0.4323416 0.0787068 0.0075344 -0.0053517 -0.0015272 0.0291064 -0.0846632 -0.0145235 -0.0776985 -0.0681444 0.1014534 0.0015606 0.0047047 0.0041542 -0.002908 0.0888733 0.0059033 0.0790905 -0.0085057 0.0702634 -0.0165962 0.0057248 0.0447228 0.0325965 -0.0838462 0.0225323 -0.1073013 -0.0505672 0.0555142 -0.0026835 -0.0154547 0.0710017 -0.0151964 0.0989837 -0.0026485 0.1283864 -0.0160071 -0.0265769 0.0397989 0.0063981 0.0702901 -0.0198769 -0.100343 0.0061354 -0.099587 -0.0786584 -0.0287367 0.0414406 0.0054344 0.0700431 -0.0780894 0.0984436 0.0177087 0.0995055 -0.021254 0.0870641 -0.043457 -0.0492078 -0.0201579 -0.0501804 -0.0953574 0.0041103 -0.119639 0.0584934 0.1020515 0.0189437 0.0204175 0.0156698 0.1026011 0.0319737 -0.013711 0.0452837 -0.0753579 -0.074578 -0.0396528 0.0481604 -0.0808896 0.0485908 0.0390298 0.0688457 0.0148261 0.1068148 -0.0111571 0.0371588 0.0056318 -0.0349064 -0.101851 -0.0345352 -0.0057015 -0.0346981 0.1822793 -0.0559817 -0.0897536 -0.0090083 -0.0784324 0.0088672 -0.0235136 -0.0071861 -0.0229067 0.2078167 0.1003753 0.0156847 0.0025035 0.0509829 -0.0716281 -0.0335602 0.0064174 -0.0340007 0.2029083 unknown
polarizability: 151.6855712|-3.2659576|86.2282279|-0.1770992|1.174397|56.737584 unknown
InChI: InChI=1S/C7H12OS/c1-3-9-6-4-5-7(2)8/h3H,1,4-6H2,2H3
charge 0 multiplicity 1
21 atoms
S  -2.378748 0.775734 0.128588
O  3.04934 1.310425 -0.1547
C  0.391132 0.307164 0.043229
C  1.592571 -0.652135 -0.073387
C  -0.940475 -0.451483 -0.057943
C  2.951906 0.058954 -0.062656
C  4.181673 -0.833151 0.076475
C  -3.772449 -0.38827 -0.006735
C  -5.07835 -0.026914 0.045351
H  0.4473 0.850623 1.004851
H  0.459717 1.07417 -0.749042
H  1.535248 -1.234046 -1.019232
H  1.584884 -1.409941 0.737418
H  -1.04546 -0.946771 -1.039614
H  -1.036888 -1.204574 0.744372
H  4.066124 -1.779374 -0.481997
H  4.320136 -1.097891 1.143441
H  5.082055 -0.298621 -0.264711
H  -3.473384 -1.436448 -0.13532
H  -5.863161 -0.785823 -0.040706
H  -5.399672 1.01237 0.172319
