program: Gaussian 09
title: 000287572
version: EM64L-G09RevD.01
frameworkgroup: C1[X(C7H13ClO2)]
method: RPBEPBE
basis: SDD
operation: Freq
keyword: #p
keyword: freq=noraman
keyword: PBEPBE/SDD
title: #p freq=noraman PBEPBE/SDD
converged: YES YES NO NO
title: Mulliken charges:
elementType: Cl O O C C C C C C C H H H H H H H H H H H H H
charge: -0.074091 -0.282611 -0.224003 0.165813 -0.611631 -0.697546 -0.679822 0.254386 -0.262005 -0.662068 0.261312 0.288060 0.219504 0.232836 0.238658 0.246163 0.201058 0.232748 0.220001 0.233781 0.213474 0.254858 0.231122
chargesum: 0.00000
title: Mulliken charges with hydrogens summed into heavy atoms:
elementType: Cl O O C C C C C C C
charge: -0.074091 -0.282611 -0.224003 0.165813 -0.062258 -0.006547 0.000147 0.254386 0.191777 0.037387
polarizability: 9.67946220e+01 -6.02057937e+00 8.95033791e+01 4.68945064e-01 3.62018209e+00 8.23663618e+01
1716.lowfreq: -10.4258 -0.0008 0.0015 0.0021 10.1633 16.8656 43.9893 53.8699 81.0383
frequency: 43.8284 53.8531 80.7633 109.9426 165.7215 171.3358 184.8795 214.5898 227.6802 260.2734 301.3005 320.2928 332.3345 398.8864 421.2612 487.3207 551.2938 672.8671 723.5270 741.5678 812.7713 820.1924 866.3952 909.6808 939.1974 959.7303 1009.5388 1015.1537 1091.6579 1099.8600 1123.6853 1153.0150 1158.8138 1235.6273 1278.2688 1283.1817 1289.5248 1354.2941 1376.2102 1396.6535 1398.6462 1432.7860 1458.3732 1460.0456 1463.5602 1465.6243 1475.5400 1483.3332 1487.5540 1638.5493 2985.1748 2995.0072 2996.2190 3028.7132 3057.8266 3083.2018 3090.2897 3094.7490 3095.2721 3097.7386 3111.5441 3120.4765 3151.2972
redmass: 3.8057 5.6583 4.1955 3.6321 3.5546 1.5490 1.1889 1.5229 1.1641 2.0068 3.2657 2.6553 3.6841 3.1257 3.3321 3.6161 3.5245 5.9043 6.4975 3.0548 1.9380 1.9467 2.0822 1.7251 1.6960 1.5653 1.9446 1.6321 2.4232 1.9923 1.7823 2.0088 1.8370 3.2354 1.1205 1.4217 1.9045 1.2699 1.1800 1.2261 1.1931 1.1010 1.0862 1.0559 1.0450 1.0497 1.0525 1.0525 1.0639 9.8242 1.0344 1.0364 1.0368 1.0595 1.0577 1.0998 1.0975 1.1037 1.0990 1.1010 1.0999 1.1053 1.1100
irintensity: 0.6505 2.4297 1.1366 0.9713 1.0229 2.1435 0.6038 0.1513 0.2734 1.5956 3.1127 3.9376 14.3942 1.5431 8.9638 5.5352 3.5479 19.3981 13.0508 10.0257 6.5000 7.2798 1.1357 17.4161 9.3768 6.0213 13.4258 25.2685 223.7226 19.1772 115.2684 18.5229 4.0296 7.1119 4.0279 19.6180 9.1958 0.2668 17.3928 23.7144 28.2697 8.2317 9.4635 11.0796 13.6140 2.6226 12.9250 9.0044 34.0750 158.2586 21.6034 18.8651 21.7884 33.1316 18.6833 17.4711 34.4360 0.1348 30.8154 17.9573 14.9929 30.3498 7.9013
temp: 298.150 k
press: 1.00000 atm
elementType: 17 8 8 6 6 6 6 6 6 6 1 1 1 1 1 1 1 1 1 1 1 1 1
symmnumber: 1
zpe: 498295.4 jmol-1
zpe.correction: 0.189791 hartree
zpe.thermalcorrener: 0.202330 hartree
zpe.thermalcorrenthalpy: 0.203274 hartree
zpe.thermalcorrgfe: 0.150586 hartree
zpe.sumelectzpe: -884.244450 hartree
zpe.sumelectthermal: -884.231911 hartree
zpe.sumelectthermalent: -884.230967 hartree
zpe.sumelectthermalfe: -884.283656 hartree
dipole: -0.0811 -1.5047 -2.5781
dipole: 2.9861
quadrupole: -57.7817 -71.8840 -71.2102
quadrupole: -3.1715 0.2508 2.3405
quadrupole: 9.1770 -4.9254 -4.2516 -3.1715 0.2508 2.3405
hfenergy: -884.4342411 hartree
pointgroup: C01 [X(C7H13Cl1O2)]
dipole: -0.1614438 -0.7537502 -0.8865943 debye
dipolederiv: -0.2108992 0.050521 0.0204859 0.0249229 -0.6097726 -0.0309342 0.0224971 -0.0950301 -0.2098348 -1.472756 0.125495 -0.2263259 0.0403423 -0.3326204 -0.0111108 -0.3029553 0.0416312 -0.6168919 -0.6300118 -0.0274321 0.1580739 0.0078998 -0.2773317 0.0749103 -0.2041514 0.1145472 -0.8950903 -0.0481292 0.0381745 0.0878177 0.0593993 -0.0434534 -0.0284933 0.1420971 -0.1128199 -0.0590707 0.1173738 -0.0634482 -0.0464551 -0.0268427 0.7588186 0.1014887 -0.0860589 0.1216506 0.1793269 0.0041698 -0.0110508 0.002822 -0.0689158 -0.0503852 -0.0000502 -0.0279814 0.1016248 0.0296116 0.0027714 -0.0135785 -0.0631154 -0.0083792 -0.0169731 -0.0011246 -0.0241255 -0.0146355 -0.0400678 1.4562152 -0.0162261 0.0324844 -0.0139342 0.1550002 -0.0950794 0.4878697 -0.1747202 1.183286 0.8386986 -0.0804284 0.0171222 -0.0518411 0.3302765 0.0549152 -0.1503123 0.0257067 0.2500427 -0.0747842 0.0424327 -0.0122636 0.058818 -0.1243839 -0.080853 0.0417958 -0.0474966 0.0261178 -0.078521 -0.0038451 0.1147489 0.0055379 -0.0204428 -0.027911 0.0847066 -0.0249837 0.0439576 0.0509173 0.0287865 -0.1011004 0.0177608 -0.0171822 -0.0621677 -0.0842744 -0.032971 0.0035278 -0.1169989 0.0170224 0.1164505 -0.0067917 0.0850605 -0.0068353 0.1135213 -0.0303995 0.0383207 0.1118847 0.0007605 0.0075232 0.0034969 -0.0797262 0.0715717 -0.0038348 0.1110715 -0.0005492 0.0020552 -0.0347535 -0.1246189 -0.0126212 0.0893262 -0.0115232 -0.1094534 -0.0489102 -0.0180906 0.1001279 0.0268136 0.0169039 -0.0047782 -0.035752 -0.1084448 -0.0145734 -0.0824281 0.0512628 -0.1363796 -0.0008012 0.0667481 -0.0002425 0.1010717 -0.0036851 0.1264867 -0.00807 0.0220895 0.107181 -0.0224779 0.0053244 0.0056492 -0.0388606 0.1175552 -0.0281488 0.102689 0.0097828 -0.0525271 -0.024245 -0.0550185 -0.0301178 0.0295074 -0.0739225 -0.0853581 -0.1067829 -0.0348664 0.0080867 0.0368287 -0.0167608 -0.0041909 -0.0276753 0.0689683 0.0997497 0.1072163 -0.0066265 -0.168159 0.0169748 0.0714497 0.0213443 0.086441 0.0099882 0.0821802 -0.0044735 0.1027588 0.0620595 -0.0580381 -0.104186 -0.022042 0.0510277 -0.0343411 -0.0940849 -0.0537715 -0.0048826 0.1276251 -0.0274848 0.0318897 0.005526 -0.0119702 0.0770785 0.0144086 0.1113552 -0.0541141 unknown
polarizability: 97.0424988|-5.3218685|90.3077294|-1.070828|3.1431119|81.3141348 unknown
InChI: InChI=1S/C7H13ClO2/c1-4-10-6(9)7(2,3)5-8/h4-5H2,1-3H3
charge 0 multiplicity 1
23 atoms
Cl 0.840794 2.384549 -0.689792
O  -1.292003 -0.46026 -0.662223
O  -0.466515 -0.603739 1.512105
C  1.115439 -0.450084 -0.40775
C  1.147734 0.67797 -1.458867
C  1.311946 -1.793283 -1.18411
C  2.220181 -0.280925 0.657502
C  -0.264821 -0.498869 0.282463
C  -2.692033 -0.438429 -0.131802
C  -3.106308 0.990203 0.230527
H  2.14051 0.752736 -1.929027
H  0.352795 0.562422 -2.208104
H  2.297711 -1.80088 -1.684506
H  1.282712 -2.642844 -0.479214
H  0.523012 -1.940232 -1.941492
H  2.098606 0.667133 1.206712
H  3.214048 -0.285535 0.173376
H  2.177443 -1.103478 1.390604
H  -3.2890 -0.848288 -0.962179
H  -2.744154 -1.108473 0.744497
H  -4.167235 1.000751 0.542646
H  -2.496216 1.3751 1.06421
H  -2.990546 1.666055 -0.633876
