program: Gaussian 09
title: 000287579
version: EM64L-G09RevD.01
frameworkgroup: C1[X(C9H16O3S)]
method: RPBEPBE
basis: SDD
operation: Freq
keyword: #p
keyword: freq=noraman
keyword: PBEPBE/SDD
title: #p freq=noraman PBEPBE/SDD
converged: YES YES NO NO
title: Mulliken charges:
elementType: S O O O C C C C C C C C C H H H H H H H H H H H H H H H H
charge: 0.168765 -0.248389 -0.209723 -0.269688 -0.329532 -0.677655 -0.479419 -0.651040 0.221392 -0.263038 -0.767229 0.322799 -0.745655 0.226182 0.238389 0.235243 0.294056 0.228097 0.235674 0.267558 0.247069 0.251055 0.228364 0.230346 0.242542 0.256088 0.246897 0.258827 0.242025
chargesum: 0.00000
title: Mulliken charges with hydrogens summed into heavy atoms:
elementType: S O O O C C C C C C C C C
charge: 0.168765 -0.248389 -0.209723 -0.269688 0.135039 -0.148355 -0.015648 -0.136413 0.221392 0.216382 -0.038253 0.322799 0.002094
polarizability: 1.48942666e+02 -1.22606289e+01 1.12615812e+02 1.89192856e+00 6.11115630e-01 1.08880257e+02
1716.lowfreq: -10.8682 -0.0012 0.0018 0.0019 8.7850 10.1517 21.3221 29.6729 46.9423
frequency: 20.9334 29.3175 46.8019 58.8307 65.3394 74.3287 85.7829 95.1329 100.0571 124.9806 138.1147 173.0299 224.0216 253.6290 311.5190 332.3504 387.4643 414.1330 462.0856 476.3643 555.1111 577.4849 601.6877 622.2850 690.1421 731.9849 760.5618 810.8630 832.6441 846.4280 939.6688 942.1540 952.3671 985.0540 1008.5411 1040.1441 1046.4736 1048.3587 1069.4918 1076.2208 1135.8690 1167.4628 1190.9243 1200.8568 1224.0001 1238.2346 1257.3589 1291.1172 1297.8080 1309.8098 1353.3140 1357.9443 1368.7194 1382.4100 1419.6543 1431.9668 1443.5481 1452.8168 1454.0682 1456.4357 1458.9620 1468.3430 1478.2822 1637.6057 1650.4177 2954.3254 2980.6103 2992.4757 3005.8750 3008.0167 3009.7666 3011.4182 3023.9856 3061.3070 3067.2147 3083.4088 3086.5107 3099.4171 3101.6048 3118.9074 3142.2058
redmass: 4.8464 3.8379 1.1546 2.7489 3.6322 1.9266 2.0261 2.5574 2.6033 5.0327 2.5823 3.6435 4.2835 5.8801 2.6390 3.1785 3.6266 2.9622 2.1230 2.7237 3.2581 4.1558 3.9083 5.1759 5.6555 1.1661 3.3125 1.3024 3.1593 2.4538 1.5825 2.5964 1.7712 1.7771 2.0747 1.6811 1.5875 2.6693 2.7836 2.5758 1.3840 2.0416 1.4893 2.1740 1.2320 1.2916 1.3168 1.0859 1.2038 1.4082 1.5273 1.3662 1.2374 1.2546 1.0875 1.0911 1.0653 1.0617 1.0552 1.0586 1.0848 1.0790 1.0939 7.8187 8.6943 1.0622 1.0380 1.0580 1.0924 1.0376 1.0594 1.0622 1.0588 1.1034 1.0951 1.1058 1.1063 1.1044 1.0950 1.1005 1.1022
irintensity: 4.4806 2.1599 1.8470 1.9560 0.3592 1.2432 3.9994 0.5010 0.5374 3.0391 2.9605 1.1913 10.3786 1.5488 5.9197 3.1083 9.3703 9.2644 1.9543 8.0971 11.5708 3.3318 8.7648 2.8008 1.4339 6.7132 8.6884 2.7616 5.3631 7.3059 11.0709 23.8256 4.9552 1.6084 58.1469 11.0179 21.7806 5.2186 5.0418 2.3797 0.4479 48.7617 70.7720 143.2503 21.8637 12.2028 38.5239 5.3707 40.7653 43.2835 7.8976 9.3433 61.3774 59.3841 10.7873 22.9307 20.0384 30.5227 19.0698 19.5696 10.6284 9.4794 8.6517 105.9626 169.3585 17.0775 4.8330 21.2492 9.7410 1.3939 15.5919 15.7471 56.1640 2.9172 15.1605 6.4892 25.5027 14.1919 9.4954 14.9264 8.3783
temp: 298.150 k
press: 1.00000 atm
elementType: 16 8 8 8 6 6 6 6 6 6 6 6 6 1 1 1 1 1 1 1 1 1 1 1 1 1 1 1 1
symmnumber: 1
zpe: 621381.4 jmol-1
zpe.correction: 0.236672 hartree
zpe.thermalcorrener: 0.253420 hartree
zpe.thermalcorrenthalpy: 0.254364 hartree
zpe.thermalcorrgfe: 0.188669 hartree
zpe.sumelectzpe: -975.243403 hartree
zpe.sumelectthermal: -975.226655 hartree
zpe.sumelectthermalent: -975.225711 hartree
zpe.sumelectthermalfe: -975.291406 hartree
dipole: 1.6632 0.3785 -3.5278
dipole: 3.9185
quadrupole: -83.0782 -83.6336 -87.3111
quadrupole: -6.1627 12.3671 8.2531
quadrupole: 1.5961 1.0407 -2.6368 -6.1627 12.3671 8.2531
hfenergy: -975.480075 hartree
pointgroup: C01 [X(C9H16O3S1)]
dipole: -0.5460315 -0.9068357 1.120822 debye
polarizability: 148.493694|10.0657428|112.610193|8.1426644|2.1112769|109.3348485 unknown
InChI: InChI=1S/C9H16O3S/c1-8(10)4-3-6-13-7-5-12-9(2)11/h3-7H2,1-2H3
charge 0 multiplicity 1
29 atoms
S  -0.769376 -0.604203 -1.965196
O  -3.336311 -0.390083 0.02583
O  4.484994 0.883426 -1.589843
O  -1.636005 0.51891 1.353991
C  1.85851 -0.126665 -1.100211
C  0.602835 -0.91251 -0.68776
C  2.978746 -0.278532 -0.051587
C  -2.023994 -1.905985 -1.426654
C  4.288157 0.41923 -0.436094
C  -2.622213 -1.69053 -0.031015
C  5.342203 0.532163 0.661877
C  -2.689793 0.662564 0.692271
C  -3.447696 1.953249 0.487498
H  1.613289 0.946067 -1.214851
H  2.225261 -0.467828 -2.084727
H  0.803453 -2.000128 -0.665956
H  0.222973 -0.579281 0.293544
H  3.216663 -1.352979 0.109664
H  2.652721 0.099862 0.939315
H  -2.813309 -1.863962 -2.196009
H  -1.544506 -2.901551 -1.469166
H  -1.853686 -1.714142 0.760906
H  -3.394354 -2.452618 0.174377
H  5.371789 -0.372835 1.295039
H  5.087633 1.384503 1.32237
H  6.334163 0.720996 0.222114
H  -4.534706 1.775872 0.485725
H  -3.173092 2.374152 -0.496854
H  -3.17415 2.675639 1.270503
