program: Gaussian 09
title: 000287604
version: EM64L-G09RevD.01
frameworkgroup: C1[X(C21H25NO)]
method: RPBEPBE
basis: SDD
operation: Freq
keyword: #p
keyword: freq=noraman
keyword: PBEPBE/SDD
title: #p freq=noraman PBEPBE/SDD
converged: YES YES NO NO
title: Mulliken charges:
elementType: O N C C C C C C C C C C C C C C C C C C C C C H H H H H H H H H H H H H H H H H H H H H H H H H
charge: -0.218501 -0.030337 0.278013 -0.041775 -0.499229 -0.476431 -0.500993 -0.572994 -0.415040 -0.407687 -0.079778 -0.574538 0.351951 -0.098733 -0.433571 -0.726196 -0.179148 0.412056 -0.387100 -0.376763 -0.238826 -0.244501 -0.237548 0.198981 0.246871 0.213314 0.197011 0.203874 0.220961 0.209190 0.252474 0.235868 0.228203 0.205197 0.191523 0.206995 0.234977 0.230462 0.298658 0.262766 0.227591 0.237064 0.226648 0.243588 0.231640 0.231367 0.229129 0.233317
chargesum: 0.00000
title: Mulliken charges with hydrogens summed into heavy atoms:
elementType: O N C C C C C C C C C C C C C C C C C C C C C
charge: -0.218501 -0.030337 0.278013 0.157206 -0.039043 -0.075546 -0.070842 -0.084652 0.018360 -0.009168 -0.079778 -0.109099 0.351951 0.199926 -0.170805 -0.034893 -0.179148 0.412056 -0.143513 -0.145124 -0.007459 -0.015372 -0.004231
polarizability: 3.53354966e+02 1.12928548e+01 1.84623067e+02 -1.17806465e+01 1.84655693e+01 1.82502038e+02
1716.lowfreq: -4.6374 -0.0003 -0.0002 0.0007 3.5620 11.5998 18.0527 29.6184 33.8387
frequency: 17.2139 29.5361 33.6010 50.4191 73.2288 86.3728 116.4461 129.0676 137.8659 156.5478 188.4235 199.9463 212.9443 225.2620 244.3213 256.7031 269.9483 284.0420 306.8299 319.3258 354.0802 381.7575 404.7790 407.8559 420.6103 438.6398 457.8422 481.0909 503.6177 523.0922 540.7755 551.6117 573.4158 611.4453 620.8469 641.8565 687.3696 702.0942 736.3616 762.5875 782.8202 787.8659 798.9890 819.8248 828.5427 851.8707 857.9092 882.5649 895.6404 910.3716 913.5325 937.6496 952.0903 958.0017 972.6042 978.1782 986.0870 988.6295 998.1394 1016.1324 1027.5861 1033.8476 1051.6680 1063.5465 1085.5305 1088.5288 1099.1352 1107.2062 1114.8542 1129.4556 1144.1401 1151.5050 1161.4663 1174.5399 1183.0449 1194.2507 1205.7933 1225.7770 1238.0916 1257.5337 1265.1387 1268.7807 1281.3464 1301.0919 1319.3616 1322.0131 1322.9429 1332.0557 1336.2476 1339.8015 1340.3331 1349.1011 1351.6593 1357.0946 1368.6819 1390.3965 1391.6082 1436.4979 1462.7147 1463.7870 1468.8552 1471.9328 1472.8351 1475.6416 1477.9385 1482.5189 1485.7165 1488.1168 1534.3812 1578.6536 1608.3814 1629.4366 2183.0871 2922.7132 2949.5523 2965.2751 2970.3884 2982.2086 2982.8969 2986.8655 2988.9481 2990.2363 3002.1925 3019.8211 3032.3948 3039.6512 3047.1508 3061.5837 3063.7531 3075.7377 3090.2977 3091.4400 3096.3061 3124.0804 3130.2914 3143.8422 3155.5634 3168.2485
redmass: 5.2251 4.5955 4.2340 3.9119 4.8313 6.5040 4.6544 3.5426 3.7993 3.1163 4.7240 3.2751 1.4278 2.4766 3.0372 3.6819 2.8853 2.5612 3.3525 2.3926 2.2128 3.3921 3.1369 3.3792 3.1312 2.9624 3.6613 2.4462 2.7043 3.7110 2.4044 5.3043 3.9839 4.8548 3.6804 3.2722 4.4335 1.7335 3.0210 2.6981 2.4512 2.1513 2.7307 2.7795 1.7230 1.2561 2.4593 1.6087 2.2509 1.6795 1.5405 2.0998 1.6796 2.2201 1.9657 1.4685 1.7213 4.7226 1.3334 2.0379 2.3209 2.2520 2.0920 2.4296 1.6684 1.9022 2.5654 1.5643 2.2352 2.1146 1.8128 1.9691 1.8105 1.0623 1.5904 1.1409 1.5633 1.9617 1.4472 1.3396 1.4120 1.7259 1.2248 1.2517 1.4605 1.3915 1.3485 1.3807 1.3414 1.4141 1.4209 1.4507 1.3565 1.6023 2.4759 2.0001 1.3257 2.1906 1.0793 1.1209 1.0873 1.0892 1.0476 1.0757 1.0648 2.0857 1.0841 1.0881 11.0282 5.6973 5.9651 8.3820 12.5294 1.0816 1.0717 1.0619 1.0624 1.0797 1.0689 1.0602 1.0358 1.0621 1.0611 1.0987 1.0991 1.1011 1.1003 1.1000 1.0960 1.0864 1.1009 1.0878 1.1006 1.0860 1.0872 1.0923 1.0954 1.1012
irintensity: 0.1912 1.1417 2.8558 0.1834 3.4051 3.9665 0.3785 1.9671 0.6577 2.4196 1.2806 0.7572 0.4368 0.6589 1.0547 1.1668 1.1215 1.4237 7.0288 5.2539 0.4792 4.2735 0.8270 0.9914 0.3984 0.8451 5.3913 1.3582 14.1335 0.3629 1.0337 14.4639 4.1133 1.0339 0.6178 5.2341 0.3621 52.6827 9.9559 27.9441 10.8398 2.0003 10.8132 1.0357 5.9316 0.3318 8.2704 24.8344 8.9972 23.3076 1.5119 15.5725 18.1176 6.3704 4.8243 0.8882 9.3403 0.3310 0.3827 9.6167 2.1669 95.5902 2.7614 2.4891 7.8613 2.1214 4.3275 2.5659 9.0649 1.5814 20.0996 26.5850 85.7528 1.0165 1.0980 0.4549 38.4804 1.8956 14.0593 4.9672 5.9407 54.9333 7.4854 6.1158 4.0167 6.8070 0.2102 0.7458 0.4719 0.6117 0.5527 0.4978 0.9118 0.5523 0.8659 3.2524 7.9595 10.0884 6.6017 5.5580 4.9695 2.3546 7.7264 30.6166 6.7443 36.4375 7.1934 7.5511 182.5431 2.7412 1.6929 37.8130 17.5108 17.7870 14.5322 36.6436 24.9759 9.6094 10.1375 46.1602 16.8604 29.5002 25.1810 44.8241 50.4755 52.8827 68.6760 19.7442 40.6196 1.3189 25.5664 22.2572 26.4275 4.0511 0.1496 15.6551 40.5307 22.0332
temp: 298.150 k
press: 1.00000 atm
elementType: 8 7 6 6 6 6 6 6 6 6 6 6 6 6 6 6 6 6 6 6 6 6 6 1 1 1 1 1 1 1 1 1 1 1 1 1 1 1 1 1 1 1 1 1 1 1 1 1
symmnumber: 1
zpe: 1067274.2 jmol-1
zpe.correction: 0.406503 hartree
zpe.thermalcorrener: 0.427918 hartree
zpe.thermalcorrenthalpy: 0.428862 hartree
zpe.thermalcorrgfe: 0.355152 hartree
zpe.sumelectzpe: -943.492963 hartree
zpe.sumelectthermal: -943.471548 hartree
zpe.sumelectthermalent: -943.470604 hartree
zpe.sumelectthermalfe: -943.544314 hartree
dipole: 4.8957 -3.3813 -2.5988
dipole: 6.4927
quadrupole: -146.5079 -140.9266 -137.2966
quadrupole: 16.6518 -0.0560 -0.1125
quadrupole: -4.9309 0.6504 4.2805 16.6518 -0.0560 -0.1125
hfenergy: -943.899466 hartree
pointgroup: C01 [X(C21H25N1O1)]
dipole: 1.9695524 1.2282729 1.0663969 debye
polarizability: 353.2658856|-14.6498101|182.7333838|8.0061513|18.5487109|184.4808019 unknown
InChI: InChI=1S/C21H25NO/c1-16(15-22)14-21-12-6-5-9-19(21)11-10-18(20(21)23)13-17-7-3-2-4-8-17/h2-4,7-8,13,16,19H,5-6,9-12,14H2,1H3
charge 0 multiplicity 1
48 atoms
O  -0.514742 -0.670628 -1.933715
N  -4.720299 -2.67671 0.312715
C  -1.753993 0.495807 -0.176338
C  -1.609042 1.940112 0.42457
C  -2.969517 0.484702 -1.148816
C  -2.906551 2.414397 1.124273
C  -0.350212 2.085588 1.303651
C  -1.901297 -0.58677 0.963133
C  -4.276614 0.975411 -0.482514
C  -4.111867 2.374291 0.156018
C  -0.455901 0.092633 -0.919244
C  0.921678 1.815813 0.46732
C  0.872774 0.518603 -0.333288
C  -2.124868 -2.058692 0.47287
C  1.948144 -0.270417 -0.669485
C  -1.422197 -3.081295 1.411707
C  -3.562423 -2.390559 0.372354
C  3.366633 -0.199494 -0.267165
C  4.346668 -0.618984 -1.215343
C  3.819212 0.201888 1.024355
C  5.722382 -0.586837 -0.908777
C  5.19419 0.215644 1.337831
C  6.154301 -0.164894 0.370512
H  -1.465376 2.614686 -0.451368
H  -3.109063 -0.521643 -1.579142
H  -2.725798 1.144766 -2.00627
H  -2.75271 3.4468 1.497235
H  -3.119287 1.791785 2.016687
H  -0.397078 1.40721 2.177331
H  -0.303305 3.115583 1.708015
H  -2.725882 -0.297211 1.63843
H  -0.981261 -0.591067 1.576566
H  -4.609167 0.250398 0.284956
H  -5.079903 0.99957 -1.243487
H  -3.952396 3.12521 -0.645724
H  -5.039371 2.66401 0.686322
H  1.82355 1.872932 1.094773
H  1.015464 2.642767 -0.270357
H  -1.695742 -2.167445 -0.543892
H  1.713373 -1.069473 -1.390716
H  -0.33304 -2.897679 1.402968
H  -1.602797 -4.118114 1.079729
H  -1.786901 -2.982163 2.449488
H  4.016965 -0.957991 -2.204891
H  3.093398 0.456903 1.802883
H  6.455388 -0.89947 -1.660547
H  5.518091 0.514378 2.3411
H  7.221885 -0.14805 0.615693
