program: Gaussian 09
title: 000287565
version: EM64L-G09RevD.01
frameworkgroup: C1[X(C10H18O4S)]
method: RPBEPBE
basis: SDD
operation: Freq
keyword: #p
keyword: freq=noraman
keyword: PBEPBE/SDD
title: #p freq=noraman PBEPBE/SDD
converged: YES YES NO NO
title: Mulliken charges:
elementType: S O O O O C C C C C C C C C C H H H H H H H H H H H H H H H H H H
charge: 0.141130 -0.440295 -0.440343 -0.217201 -0.217086 0.228282 0.228389 -0.715755 -0.715874 -0.699987 -0.692776 -0.699895 -0.692730 0.168691 0.168446 0.300195 0.252639 0.300245 0.252637 0.220292 0.230005 0.235677 0.245991 0.202631 0.234637 0.220323 0.229981 0.235646 0.246091 0.202599 0.234582 0.376415 0.376419
chargesum: 0.00000
title: Mulliken charges with hydrogens summed into heavy atoms:
elementType: S O O O O C C C C C C C C C C
charge: 0.141130 -0.063880 -0.063925 -0.217201 -0.217086 0.228282 0.228389 -0.162921 -0.162992 -0.014014 -0.009517 -0.013945 -0.009458 0.168691 0.168446
polarizability: 1.59954467e+02 -9.68913518e+00 1.30860608e+02 -1.94058701e-02 1.49873064e-02 1.21828211e+02
1716.lowfreq: -11.8871 -5.1498 -0.0006 -0.0004 0.0010 13.7346 26.5867 37.5686 52.8873
frequency: 23.4946 37.5462 52.8820 64.7207 67.5252 90.9484 120.0898 171.6132 177.1751 203.2243 206.2390 226.1795 229.3175 249.4823 250.7993 272.1608 286.7978 316.4942 325.6345 342.3352 373.9024 392.6733 400.1231 488.3435 489.3620 526.8442 528.1953 591.4870 592.0855 665.3137 667.5207 702.6199 708.7582 726.1038 728.4855 825.2775 849.6249 884.8698 904.3779 935.4958 938.0259 956.0180 959.8575 1002.3731 1007.2489 1034.2608 1034.3482 1108.3211 1136.0063 1147.4461 1152.5440 1218.1335 1218.5747 1234.3182 1246.3064 1268.7526 1284.8266 1305.9967 1310.8353 1374.0040 1374.3145 1395.1602 1396.7366 1430.9923 1445.3280 1461.4561 1462.8960 1467.4664 1467.4925 1475.7765 1475.8181 1490.2053 1490.4848 1659.3716 1661.1191 2983.0828 2983.1790 2992.5116 2992.7011 3026.5143 3027.9122 3082.3239 3082.4020 3090.6944 3090.9349 3094.8758 3094.9547 3104.0181 3104.2556 3115.9104 3115.9827 3511.4471 3511.5696
redmass: 6.7095 4.9620 8.7940 9.0339 5.3398 4.7001 5.2358 4.0174 3.4220 1.1393 1.1788 1.9881 1.8794 1.2238 1.3285 2.4813 2.7692 3.2164 3.0757 2.7089 2.4681 2.6126 3.4958 3.6480 3.6011 4.2696 3.9541 1.2456 1.2608 4.5216 4.0640 4.0796 4.3841 4.8201 5.4388 1.8766 2.3070 1.9376 1.7477 1.7817 1.6968 1.6338 1.7159 1.4527 1.4721 2.2880 2.2695 1.3003 1.7051 2.1818 1.6874 2.4891 2.4479 1.4567 1.7152 1.5846 1.2979 2.4638 2.4093 1.1861 1.1886 1.1923 1.2000 1.0924 1.0766 1.0513 1.0555 1.0496 1.0492 1.0506 1.0506 1.0661 1.0670 8.6388 8.6551 1.0342 1.0342 1.0359 1.0359 1.0608 1.0605 1.1002 1.1002 1.0999 1.0999 1.1010 1.1010 1.0996 1.0996 1.1034 1.1038 1.0640 1.0640
irintensity: 1.8318 0.3817 0.2782 0.5678 0.0529 0.4386 0.3218 0.5975 0.0273 0.0768 0.0130 0.1476 0.2200 0.0148 0.6601 1.1441 0.0001 2.1108 2.2974 5.6079 4.4527 0.3316 1.8003 11.0767 17.5327 14.5090 3.8221 143.8890 107.6517 5.3373 0.2011 7.9180 4.3477 60.1154 17.6691 7.3893 4.9479 27.9989 9.2224 5.2735 21.5601 4.0475 27.2273 38.3579 31.7403 182.6276 160.7151 1.0846 0.5868 8.2894 1.4995 22.6325 0.7278 1.4812 0.0679 8.1267 0.0018 42.0742 13.3774 8.2758 22.0772 46.4003 23.9315 8.4550 0.0193 6.1119 10.2840 2.4358 3.0683 10.6320 13.9264 28.5946 5.9883 374.1069 68.7983 28.8497 17.3643 22.5251 19.4189 0.2283 32.6542 16.2171 17.1508 12.7400 34.3130 18.3258 19.4725 40.7375 8.1300 3.5414 5.9317 21.1104 19.2394
temp: 298.150 k
press: 1.00000 atm
elementType: 16 8 8 8 8 6 6 6 6 6 6 6 6 6 6 1 1 1 1 1 1 1 1 1 1 1 1 1 1 1 1 1 1
symmnumber: 1
zpe: 704565.8 jmol-1
zpe.correction: 0.268355 hartree
zpe.thermalcorrener: 0.286887 hartree
zpe.thermalcorrenthalpy: 0.287831 hartree
zpe.thermalcorrgfe: 0.221184 hartree
zpe.sumelectzpe: -1089.633085 hartree
zpe.sumelectthermal: -1089.614553 hartree
zpe.sumelectthermalent: -1089.613609 hartree
zpe.sumelectthermalfe: -1089.680256 hartree
dipole: 0.0069 0.0078 -3.2070
dipole: 3.2071
quadrupole: -107.3097 -94.6726 -97.5058
quadrupole: -15.6005 -0.0370 0.0005
quadrupole: -7.4803 5.1567 2.3236 -15.6005 -0.0370 0.0005
hfenergy: -1089.9014403 hartree
pointgroup: C01 [X(C10H18O4S1)]
dipole: 0.0085356 -0.0052482 1.2617128 debye
polarizability: 157.9653795|12.1566674|132.8492569|-0.1172403|-0.0153726|121.8286499 unknown
InChI: InChI=1S/C10H18O4S/c1-9(2,7(11)12)5-15-6-10(3,4)8(13)14/h11,13H,5-6H2,1-4H3
charge 0 multiplicity 1
33 atoms
S  -0.008732 0.008091 -1.049488
O  -1.923888 0.967429 1.82038
O  1.935859 -0.978736 1.797002
O  -3.586992 1.454749 0.286183
O  3.58065 -1.457701 0.240528
C  -2.494523 -0.787676 0.221045
C  2.491766 0.787177 0.204185
C  -0.977016 -1.104575 0.150787
C  0.97395 1.106695 0.151978
C  -3.141441 -1.749168 1.271473
C  -3.172657 -0.969589 -1.155932
C  3.151029 1.740205 1.254678
C  3.155698 0.978154 -1.178447
C  -2.739755 0.644245 0.715588
C  2.74062 -0.648423 0.686112
H  -0.489707 -1.011743 1.133223
H  -0.843186 -2.135883 -0.220129
H  0.496298 1.005669 1.138366
H  0.838245 2.141583 -0.208178
H  -2.995316 -2.796656 0.950176
H  -4.227796 -1.565107 1.351196
H  -2.686702 -1.617236 2.268585
H  -2.708518 -0.312186 -1.911207
H  -3.06852 -2.018809 -1.487555
H  -4.245019 -0.718314 -1.101888
H  3.005078 2.790099 0.941296
H  4.237539 1.552565 1.323296
H  2.705116 1.603291 2.255101
H  2.682505 0.326913 -1.933405
H  3.049567 2.029887 -1.501331
H  4.228202 0.725047 -1.13754
H  -2.162468 1.882327 2.132421
H  2.176316 -1.896321 2.099601
