program: Gaussian 09
title: 000287547
version: EM64L-G09RevD.01
frameworkgroup: C1[X(C4H8S3)]
method: RPBEPBE
basis: SDD
operation: Freq
keyword: #p
keyword: freq=noraman
keyword: PBEPBE/SDD
title: #p freq=noraman PBEPBE/SDD
converged: YES YES NO NO
title: Mulliken charges:
elementType: S S S C C C C H H H H H H H H
charge: 0.264687 0.264686 0.265433 -0.684912 -0.865977 -0.865977 -0.589854 0.318088 0.303554 0.291268 0.291268 0.303554 0.242124 0.242124 0.219934
chargesum: 0.00000
title: Mulliken charges with hydrogens summed into heavy atoms:
elementType: S S S C C C C
charge: 0.264687 0.264686 0.265433 -0.366823 -0.271156 -0.271155 0.114328
polarizability: 1.02646498e+02 3.57674600e-05 9.80930115e+01 3.80326061e+00 -8.94655197e-06 6.54323069e+01
1716.lowfreq: -24.5006 -21.4241 -11.4948 -0.0009 0.0022 0.0027 94.2550 169.8052 204.5877
frequency: 94.1751 169.7656 204.5221 229.9815 263.1165 264.9106 311.3921 354.0565 434.0402 567.6878 596.3018 606.4542 617.3756 648.6674 666.3546 781.9426 864.8029 984.5828 1045.1779 1061.8299 1128.2713 1181.6630 1188.7454 1234.5786 1235.1764 1259.1002 1385.2102 1390.6707 1405.2404 1458.2398 1471.1058 2986.8717 3042.4677 3046.2289 3059.2647 3087.0505 3087.9764 3133.8904 3134.4224
redmass: 4.3324 2.5597 1.1237 5.8647 2.7255 5.5073 2.9324 6.7844 4.6651 3.7948 5.2609 6.7080 8.1454 7.2504 7.2653 1.4585 1.6524 1.5557 1.3851 3.2177 1.0367 1.0467 1.0923 1.1227 1.1273 1.2057 1.1841 1.0696 1.0823 1.0496 1.0437 1.0352 1.0574 1.0570 1.0873 1.0977 1.1003 1.1077 1.1076
irintensity: 0.2799 0.0003 0.2438 1.0086 3.9838 1.7759 0.3223 0.7182 3.3956 3.6190 8.2936 3.2545 0.6761 28.9254 54.7777 0.0860 12.9323 26.1222 29.3691 0.0023 8.4533 10.3192 2.6007 1.8961 7.1321 2.3435 10.0882 6.7552 20.6186 23.1373 3.9336 17.7903 33.7101 9.1502 0.8418 25.3645 12.8949 5.3507 0.0056
temp: 298.150 k
press: 1.00000 atm
elementType: 16 16 16 6 6 6 6 1 1 1 1 1 1 1 1
symmnumber: 1
zpe: 297172.2 jmol-1
zpe.correction: 0.113187 hartree
zpe.thermalcorrener: 0.121707 hartree
zpe.thermalcorrenthalpy: 0.122652 hartree
zpe.thermalcorrgfe: 0.079731 hartree
zpe.sumelectzpe: -1350.824448 hartree
zpe.sumelectthermal: -1350.815928 hartree
zpe.sumelectthermalent: -1350.814984 hartree
zpe.sumelectthermalfe: -1350.857904 hartree
dipole: -1.0897 0.0000 2.6720
dipole: 2.8857
quadrupole: -64.3351 -65.0086 -66.7443
quadrupole: 0.0000 0.6946 0.0000
quadrupole: 1.0276 0.3541 -1.3816 0.0000 0.6946 0.0000
hfenergy: -1350.9376353 hartree
pointgroup: C01 [X(C4H8S3)]
dipole: 0.480304 0.0000212 -1.0287184 debye
dipolederiv: -0.3866798 0.0730367 0.0141127 0.0401477 -0.3562106 -0.0314218 -0.0376964 0.0003692 -0.1163136 -0.386666 -0.0730399 0.0141103 -0.0401515 -0.3562243 0.0314275 -0.0376941 -0.000369 -0.1163141 -0.3810679 -0.0000062 -0.1858648 -0.0000058 -0.2896362 -0.0000098 -0.0904028 -0.0000045 -0.1132518 0.3388338 -0.0000185 -0.2139537 -0.0000174 0.6055863 -0.0000176 -0.1668349 -0.0000145 0.0715157 0.4296484 -0.2524864 0.1556549 -0.3024198 0.1991381 0.0676503 0.1453302 0.0028073 0.1184693 0.4295791 0.2525156 0.1556587 0.3024491 0.1992048 -0.0676328 0.1453251 -0.0027916 0.1184707 -0.0730966 0.0000042 0.1270444 0.0000019 -0.1268031 0.0000089 0.0756621 0.0000055 -0.0783676 0.0019656 -0.0000031 -0.0531681 -0.0000029 0.0445021 -0.0000037 -0.0311009 -0.0000024 0.0058113 0.0331335 -0.0430545 -0.0138721 -0.037212 -0.0122465 -0.002185 -0.0073201 0.0104129 0.1220159 -0.0298722 0.0881285 0.0393643 0.0801209 0.0420147 0.0438259 0.0048709 -0.0185264 -0.1252817 -0.029852 -0.0881368 0.0393701 -0.0801294 0.0419935 -0.0438229 0.0048693 0.0185251 -0.1252816 0.0331237 0.0430602 -0.0138726 0.0372177 -0.0122367 0.0021849 -0.0073194 -0.010412 0.1220157 0.0196913 -0.1004236 0.0468613 -0.1396987 -0.037066 0.0369881 0.0442546 0.0320844 0.063043 0.0196585 0.1004329 0.0468649 0.1397081 -0.0370361 -0.0369804 0.0442566 -0.0320773 0.0630439 -0.0183995 -0.0000092 -0.1583103 -0.000008 0.0950199 -0.0000116 -0.0862002 -0.0000068 -0.0095752 unknown
polarizability: 102.1785453|0.0002563|98.0930115|5.6267487|0.0000733|65.9002598 unknown
InChI: InChI=1S/C4H8S3/c1-4-6-2-5-3-7-4/h4H,2-3H2,1H3
charge 0 multiplicity 1
15 atoms
S  0.423146 -1.590566 0.769743
S  0.422951 1.590629 0.769716
S  -2.216856 -0.000137 -0.049389
C  1.387989 0.000087 0.368433
C  -1.024255 -1.409372 -0.416938
C  -1.024431 1.40924 -0.41696
C  1.992677 0.000114 -1.042504
H  2.184705 0.000143 1.131571
H  -1.603496 -2.339174 -0.318414
H  -0.655447 -1.313167 -1.449893
H  -0.655615 1.313068 -1.449915
H  -1.603787 2.338972 -0.318446
H  2.619814 0.898297 -1.184507
H  2.619935 -0.897989 -1.18449
H  1.221568 0.000054 -1.832605
