program: Gaussian 09
title: 000287620
version: EM64L-G09RevD.01
frameworkgroup: C1[X(C22H28O3)]
method: RPBEPBE
basis: SDD
operation: Freq
keyword: #pfreq=noraman
keyword: PBEPBE/SDD
title: #p freq=noraman PBEPBE/SDD
converged: NO YES NO NO
title: Mulliken charges:
elementType: O O O C C C C C C C C C C C C C C C C C C C C C C H H H H H H H H H H H H H H H H H H H H H H H H H H H H
charge: -0.286789 -0.275122 -0.275518 0.262140 -0.091648 -0.314574 0.495615 -0.485729 -0.544187 0.344794 -0.691971 -0.504358 -0.504805 -0.813520 -0.474587 0.416602 -0.547941 0.112449 -0.468906 -0.316823 -0.323173 0.178731 -0.248148 -0.403551 -0.534666 0.198513 0.230761 0.242163 0.207755 0.221326 0.244538 0.230103 0.232011 0.225538 0.217170 0.219041 0.237707 0.226468 0.217845 0.223533 0.211494 0.226567 0.240560 0.237098 0.225747 0.207970 0.229958 0.205480 0.219504 0.237919 0.219028 0.241084 0.218806
chargesum: 0.00000
title: Mulliken charges with hydrogens summed into heavy atoms:
elementType: O O O C C C C C C C C C C C C C C C C C C C C C C
charge: -0.286789 -0.275122 -0.275518 0.262140 0.106865 -0.083813 0.495615 -0.035811 -0.078324 0.344794 -0.229858 -0.061650 -0.048058 -0.145674 -0.263093 0.416602 -0.080814 0.112449 -0.231809 0.116895 0.112265 0.178731 -0.028644 -0.165631 0.144253
polarizability: 3.21686554e+02 -2.06059540e+00 2.22777624e+02 -7.93064482e+00 6.58667809e+00 1.77149035e+02
1716.lowfreq: -17.7524 -5.3184 -0.0004 0.0007 0.0009 4.3875 26.6540 36.8489 51.7375
frequency: 25.5610 36.6875 51.5810 53.5559 84.1837 101.2008 118.3059 157.7744 164.4865 180.3686 188.3732 206.8606 212.5741 230.4815 235.1235 246.5798 261.8530 281.5648 294.5871 301.8070 313.2869 334.9394 383.0180 390.2139 392.8840 402.6782 436.8483 457.4430 476.3949 486.0293 510.2408 548.0200 555.9949 564.9534 592.5066 608.8138 609.7752 616.2210 645.2449 661.7134 693.4895 711.7796 719.3045 745.4571 779.8161 795.6178 806.2198 812.1621 828.7062 842.7803 862.3046 867.0245 873.5998 904.3799 913.7445 930.6295 936.9756 952.0556 953.9802 957.2140 967.1831 977.1428 983.2074 991.2942 1017.9926 1019.7884 1040.5929 1050.4578 1057.9212 1066.1896 1085.0920 1106.3638 1112.4344 1113.7241 1116.6261 1132.5068 1142.9558 1148.6320 1154.4841 1161.9505 1173.0023 1182.2343 1185.4461 1191.8807 1196.7793 1200.9673 1215.7677 1231.4738 1234.1949 1242.1424 1246.2695 1262.2140 1287.4878 1292.1965 1302.3634 1308.3930 1318.6655 1319.2831 1326.9221 1334.3575 1339.6867 1344.3451 1345.5830 1366.0192 1374.0268 1388.0769 1392.4391 1432.0849 1441.0723 1448.7057 1454.8120 1458.7793 1460.7328 1466.2553 1467.2396 1470.8409 1471.8100 1474.4271 1475.4694 1481.8718 1486.6694 1491.0002 1593.8098 1604.4781 1685.1595 2946.9954 2956.5997 2959.9699 2961.5573 2975.5019 2978.2565 2979.6652 2981.9962 2983.0465 2986.9161 3001.0237 3008.1925 3008.8761 3027.3462 3042.8995 3050.7052 3056.1298 3063.5499 3067.8549 3069.0633 3080.2430 3084.7944 3086.5973 3097.0022 3115.4406 3119.4940 3139.7889 3164.7645
redmass: 4.3892 3.8162 3.5771 3.6637 3.7451 3.6612 3.6690 3.3559 2.3890 3.4075 1.5305 2.2692 1.8569 3.3435 2.9526 2.0119 2.0875 2.2882 2.5536 3.0333 2.9441 2.9715 2.6409 3.3178 2.6290 2.8364 3.4276 3.3747 4.6861 4.0105 3.3325 3.9522 4.5599 4.5477 3.3872 2.9667 2.6261 4.0403 3.9300 3.2521 2.9646 4.3537 2.0891 3.3525 1.8460 4.5391 1.5339 2.3221 2.2813 1.8928 2.2675 1.5470 2.1692 2.2342 3.1601 2.2755 2.4020 1.9163 2.2738 2.0201 1.8862 1.9735 2.8677 2.6337 2.1518 2.4987 2.3716 2.8947 2.9139 2.4978 1.9206 1.6830 1.5127 1.7037 1.9185 2.7868 1.3134 1.7277 1.5462 1.1625 2.1650 1.2553 1.6634 1.5448 1.3134 2.3615 1.6471 2.0731 1.5563 2.1422 1.5237 1.5172 1.4636 1.4810 1.4297 1.5335 1.3799 1.3368 1.2459 1.4907 1.6679 1.7177 1.3582 1.5022 1.5060 1.3596 3.9452 1.3164 1.0861 1.3754 1.8275 1.0795 1.0952 1.0507 1.0891 1.3326 1.0882 1.0639 1.0903 1.5216 1.0695 1.0862 6.6508 7.2258 7.8592 1.0820 1.0329 1.0640 1.0673 1.0399 1.0693 1.0634 1.0798 1.0619 1.0621 1.0651 1.0619 1.0944 1.0890 1.1036 1.0999 1.0971 1.1007 1.0976 1.0990 1.0982 1.0991 1.0905 1.1016 1.0868 1.0993 1.0923 1.0960
irintensity: 0.2642 2.0804 4.5465 1.3355 1.7097 5.0261 1.2092 1.9869 0.9390 0.3684 2.7645 0.6073 0.2680 1.1010 1.9308 2.7834 1.8763 0.6970 2.9904 0.2823 1.5843 0.4656 1.1432 0.4953 0.5362 5.4529 1.3940 7.9084 6.8959 2.1897 0.2871 2.4854 1.6814 1.1126 0.8671 3.5741 1.2146 2.8180 7.1624 7.4534 1.3213 13.8834 21.1265 12.6895 56.9593 8.2980 21.8037 9.9002 2.6944 0.2039 0.5379 1.7702 6.3481 0.6865 45.1390 1.9845 35.1736 1.8963 5.1157 1.4624 9.7325 0.1251 12.9483 9.9446 39.7838 1.5703 34.6584 95.5610 129.9012 39.0124 6.6813 2.2505 1.1201 0.2506 19.7544 20.5720 2.9024 17.8723 6.5384 0.4244 3.8424 1.8707 7.5195 1.7642 10.5332 0.2267 48.4938 7.4965 3.7844 99.2691 16.8056 9.7017 0.8904 7.8817 1.5985 13.9423 8.9713 5.5260 2.0591 4.8435 11.6161 8.8750 3.8539 19.2867 4.0558 13.7823 1.9915 23.9274 20.5321 5.0610 80.0189 8.5863 8.3267 12.1295 5.5006 10.5481 10.5620 8.5542 4.1061 2.9015 9.5396 8.5622 61.4676 24.0170 2.7282 24.3527 85.5899 26.4618 21.5498 16.0681 64.2344 15.2715 40.3199 40.4261 64.8476 18.2993 46.2931 31.6938 23.5269 48.3882 21.2203 14.7444 33.6026 25.9519 50.0849 35.9777 38.8651 41.3455 33.1623 6.4051 26.4599 22.2015 25.1235
temp: 298.150 k
press: 1.00000 atm
elementType: 8 8 8 6 6 6 6 6 6 6 6 6 6 6 6 6 6 6 6 6 6 6 6 6 6 1 1 1 1 1 1 1 1 1 1 1 1 1 1 1 1 1 1 1 1 1 1 1 1 1 1 1 1
symmnumber: 1
zpe: 1185596.3 jmol-1
zpe.correction: 0.451570 hartree
zpe.thermalcorrener: 0.473913 hartree
zpe.thermalcorrenthalpy: 0.474857 hartree
zpe.thermalcorrgfe: 0.400872 hartree
zpe.sumelectzpe: -1078.901704 hartree
zpe.sumelectthermal: -1078.879361 hartree
zpe.sumelectthermalent: -1078.878417 hartree
zpe.sumelectthermalfe: -1078.952402 hartree
dipole: 0.3920 1.1643 -0.4887
dipole: 1.3222
quadrupole: -119.5527 -143.9187 -149.3098
quadrupole: -3.4146 4.8835 1.3251
quadrupole: 18.0411 -6.3250 -11.7161 -3.4146 4.8835 1.3251
hfenergy: -1079.3532735 hartree
pointgroup: C01 [X(C22H28O3)]
dipole: 0.1464309 -0.4401349 0.2354581 debye
polarizability: 322.1008251|-0.4150812|223.5703234|3.3564978|1.3825109|175.9420645 unknown
InChI: InChI=1S/C22H28O3/c1-21-10-11-22(24-12-13-25-22)14-15(21)6-7-17-16-4-3-5-20(23-2)18(16)8-9-19(17)21/h3-6,17,19H,7-14H2,1-2H3
charge 0 multiplicity 1
53 atoms
O  -5.583295 0.30607 -0.188276
O  -4.060152 -0.875042 1.205024
O  4.816879 -2.087568 0.076368
C  -1.282857 0.238497 -1.042872
C  0.246156 -0.118186 -0.889888
C  1.049926 1.090752 -0.327394
C  -1.809694 1.040398 0.161159
C  -2.144597 -1.06215 -1.171528
C  0.588799 -1.368093 -0.039497
C  -4.137114 -0.026124 -0.013466
C  -3.317908 1.252286 0.229983
C  -3.663921 -0.796098 -1.254316
C  0.514082 1.507355 1.074247
C  -1.448096 1.084835 -2.347753
C  -0.995174 1.57966 1.107216
C  2.547781 0.806842 -0.251921
C  2.091077 -1.723095 -0.157295
C  3.02477 -0.522002 -0.131328
C  3.465888 1.890555 -0.258585
C  -6.301957 -0.19836 1.000835
C  -5.427063 -1.381431 1.450136
C  4.430668 -0.733482 -0.022357
C  4.849208 1.662117 -0.141175
C  5.345901 0.343305 -0.018686
C  6.245083 -2.37717 0.203404
H  0.620927 -0.32248 -1.917488
H  0.899329 1.959605 -0.998756
H  -1.977654 -1.697168 -0.283368
H  -1.812868 -1.634509 -2.060612
H  0.009751 -2.245922 -0.374942
H  0.314105 -1.193781 1.018021
H  -3.605899 1.68096 1.205953
H  -3.637658 1.971059 -0.551156
H  -3.92973 -0.208078 -2.151667
H  -4.219374 -1.75027 -1.316245
H  0.947097 2.489728 1.350344
H  0.884603 0.801283 1.846705
H  -0.768212 1.955083 -2.345687
H  -1.212567 0.467296 -3.235641
H  -2.47377 1.474173 -2.471389
H  -1.448913 2.111697 1.956742
H  2.265366 -2.273267 -1.105802
H  2.382462 -2.432258 0.640132
H  3.085037 2.913781 -0.362561
H  -7.316171 -0.483715 0.677334
H  -6.356666 0.583556 1.783675
H  -5.497475 -1.618595 2.523248
H  -5.628221 -2.287438 0.843737
H  5.550408 2.504159 -0.149131
H  6.422938 0.17321 0.068697
H  6.809687 -2.022901 -0.681379
H  6.312392 -3.473324 0.270881
H  6.671086 -1.920554 1.11842
