program: Gaussian 09
title: 000287643
version: EM64L-G09RevD.01
frameworkgroup: C1[X(C21H26O4)]
method: RPBEPBE
basis: SDD
operation: Freq
keyword: #pfreq=noraman
keyword: PBEPBE/SDD
title: #p freq=noraman PBEPBE/SDD
converged: NO YES NO NO
title: Mulliken charges:
elementType: O O O O C C C C C C C C C C C C C C C C C C C C C H H H H H H H H H H H H H H H H H H H H H H H H H H
charge: -0.289799 -0.290150 -0.232034 -0.261269 -0.132794 0.221708 0.289306 -0.474969 -0.467684 -0.533509 -0.402452 -0.008683 -0.773604 -0.552842 0.344124 -0.342994 -0.305884 -0.445574 0.439807 -0.324119 -0.396999 -0.389636 -0.379749 0.323053 -0.536472 0.224145 0.237537 0.190997 0.212765 0.208267 0.224033 0.224844 0.194924 0.248097 0.218748 0.231599 0.236113 0.233688 0.223948 0.234600 0.213742 0.222971 0.201786 0.265335 0.253207 0.235159 0.249746 0.242060 0.223924 0.247158 0.223826
chargesum: 0.00000
title: Mulliken charges with hydrogens summed into heavy atoms:
elementType: O O O O C C C C C C C C C C C C C C C C C C C C C
charge: -0.289799 -0.290150 -0.232034 -0.261269 0.091351 0.221708 0.289306 -0.046435 -0.046652 -0.084632 0.040568 -0.008683 -0.087143 -0.095206 0.344124 0.105348 0.118873 -0.180239 0.439807 -0.070912 -0.161840 -0.139890 -0.137689 0.323053 0.158436
polarizability: 3.97516367e+02 -2.51756963e+01 2.23631653e+02 5.47097726e+00 1.21881722e+01 1.66440067e+02
1716.lowfreq: -5.8906 -3.6366 0.0006 0.0008 0.0010 8.4245 18.2009 35.4203 38.5640
frequency: 18.0923 35.3490 38.5375 58.1434 80.0794 88.8181 91.9382 112.9728 163.9047 177.1513 181.8809 198.6818 202.4365 216.5000 222.7487 237.0726 247.5485 263.1518 276.5512 300.9945 304.4742 337.8853 343.0357 359.6980 388.7650 408.9773 419.1818 433.6499 444.8345 464.3154 476.1267 513.7810 531.7717 535.2909 552.7989 585.4455 615.6624 623.8217 641.3324 687.7574 705.9218 718.0230 728.0086 736.3775 748.2025 799.6281 808.3789 814.0317 824.1505 835.9226 846.3254 859.5340 875.1659 898.0965 913.6731 921.7392 930.7427 949.9820 959.0445 963.4380 966.5834 977.2059 982.7518 985.4832 998.9336 1002.0184 1010.1840 1039.4235 1062.3720 1070.6319 1090.3712 1101.0093 1108.9690 1112.0099 1121.9822 1129.2137 1158.2974 1160.1871 1163.6722 1170.1416 1183.5141 1189.3292 1192.8836 1204.1084 1208.9601 1228.7470 1240.2191 1257.9242 1279.7813 1294.2167 1302.1191 1310.3997 1313.4929 1322.6083 1325.5044 1331.9205 1336.7774 1341.5894 1350.9282 1353.2779 1362.3612 1382.8626 1397.9071 1428.0236 1436.6348 1449.2129 1453.5686 1462.9945 1466.4456 1467.6066 1471.4905 1472.1804 1473.0891 1478.9139 1485.0188 1495.5869 1498.7284 1530.7700 1564.1990 1617.1672 1621.4006 2963.5111 2966.0023 2969.5176 2970.3957 2975.6255 2978.2394 2986.3861 2992.9039 3000.7067 3003.9428 3020.6215 3047.7998 3053.3103 3054.2050 3056.3590 3064.5511 3072.5211 3074.5849 3082.6148 3084.4633 3098.8306 3126.5046 3128.3502 3157.4455 3162.6106 3193.8340
redmass: 4.0882 4.2654 4.8645 5.2355 3.8648 3.6596 4.2466 4.0136 4.0065 3.3035 3.1159 2.3014 3.0040 1.6583 1.7699 1.8767 1.9019 3.3041 2.9020 3.7158 2.9609 3.6342 3.0839 3.6160 2.5844 3.9241 3.0247 4.4082 3.5488 2.9123 3.9975 2.9847 2.4589 3.8407 4.4654 3.2542 2.6894 4.5480 3.3569 5.3562 4.1350 4.1344 4.8893 4.1180 4.0707 2.5876 3.1358 1.4017 2.2140 1.6303 2.2264 1.8754 2.3017 2.1744 3.3097 2.9695 1.4725 1.9570 2.0278 1.5302 1.5469 2.0447 3.3395 7.2195 2.2844 2.0908 3.0389 1.8510 1.9163 2.6795 1.8941 1.7317 1.5782 1.2595 1.5201 2.1285 1.4013 1.4566 1.6307 1.9305 1.3022 1.8231 1.3925 1.9646 1.2984 2.0113 2.8406 2.0827 1.4664 1.5197 1.5495 1.4638 1.6416 1.3513 1.2681 1.4972 1.4407 1.4899 1.4709 1.9231 1.9766 1.2176 1.9030 3.4822 1.1700 1.0977 1.1050 1.0828 1.0707 1.0498 1.0758 1.0904 1.0753 1.0878 1.0890 1.0731 2.4168 7.8670 6.7987 6.5365 7.6754 1.0328 1.0779 1.0589 1.0661 1.0387 1.0679 1.0632 1.0600 1.0626 1.0690 1.0930 1.1005 1.1041 1.1010 1.0961 1.1015 1.0988 1.0995 1.0869 1.0991 1.1011 1.0915 1.0971 1.0898 1.0942 1.0938
irintensity: 1.0645 0.4617 0.3596 0.6686 5.5779 2.6593 0.6864 6.4810 1.4179 0.2675 0.9183 2.4626 2.1312 0.6997 0.7781 2.5590 1.1535 3.4863 4.4261 3.1768 5.5385 1.5322 1.2374 1.6037 9.2639 1.3919 1.0568 3.1922 7.4619 10.1699 3.3122 5.0753 22.9079 35.5651 4.6367 2.6178 1.3045 0.1874 7.1235 3.7760 1.3751 2.1780 3.4910 6.0745 1.3285 13.1788 18.5330 15.3887 21.1551 47.5765 33.1644 12.6526 23.6835 8.4375 44.9098 3.3345 11.6127 5.3909 16.4451 0.3635 6.9355 2.3745 15.5920 57.7475 31.5763 118.6259 93.5203 7.9063 3.3683 59.6330 1.6529 55.0161 4.3986 0.2148 1.5204 20.4542 16.7134 6.2526 13.1978 91.5826 214.2756 32.8497 5.4679 74.2557 5.1213 14.9915 251.1707 6.2766 10.0494 6.6543 7.1274 0.6148 38.6857 2.5103 5.5539 7.2525 3.7579 4.2238 3.4587 1.9781 2.4730 21.1520 7.7842 38.1053 24.4502 15.6611 17.1025 10.6153 28.9183 13.9439 21.2281 50.1210 38.6976 8.3178 6.6520 22.8065 221.8252 219.5679 9.7802 190.4200 13.3558 95.1237 5.4316 23.9410 35.5063 53.0721 57.5223 58.4407 24.1947 57.4485 34.5453 26.7610 34.9516 44.8267 29.1880 38.5787 25.3391 46.8058 42.5044 1.7128 32.2813 26.1850 26.1125 8.7081 5.0878 21.6835 6.3094
temp: 298.150 k
press: 1.00000 atm
elementType: 8 8 8 8 6 6 6 6 6 6 6 6 6 6 6 6 6 6 6 6 6 6 6 6 6 1 1 1 1 1 1 1 1 1 1 1 1 1 1 1 1 1 1 1 1 1 1 1 1 1 1
symmnumber: 1
zpe: 1118504.1 jmol-1
zpe.correction: 0.426016 hartree
zpe.thermalcorrener: 0.448943 hartree
zpe.thermalcorrenthalpy: 0.449888 hartree
zpe.thermalcorrgfe: 0.373700 hartree
zpe.sumelectzpe: -1114.817921 hartree
zpe.sumelectthermal: -1114.794993 hartree
zpe.sumelectthermalent: -1114.794049 hartree
zpe.sumelectthermalfe: -1114.870237 hartree
dipole: -2.3591 2.0690 0.8010
dipole: 3.2385
quadrupole: -117.7102 -142.6614 -152.3420
quadrupole: 10.4677 1.9512 -7.9915
quadrupole: 19.8610 -5.0902 -14.7708 10.4677 1.9512 -7.9915
hfenergy: -1115.2439364 hartree
pointgroup: C01 [X(C21H26O4)]
dipole: 0.9249941 0.7350351 -0.4769782 debye
polarizability: 394.1485245|35.3988149|215.3490291|11.9823229|-23.6586763|178.0905338 unknown
InChI: InChI=1S/C21H26O4/c1-20-10-3-11-21(24-12-13-25-21)18(20)9-6-16(19(20)22)14-15-4-7-17(23-2)8-5-15/h4-5,7-8,14,18H,3,6,9-13H2,1-2H3
charge 0 multiplicity 1
51 atoms
O  -2.424995 1.491485 0.438464
O  -3.837374 1.809474 -1.43941
O  -1.070785 -1.862578 1.802429
O  6.485625 1.385463 -0.06125
C  -2.697383 -0.382374 -1.17408
C  -2.381758 -1.598952 -0.241561
C  -3.393119 0.787752 -0.434429
C  -3.617184 -1.978699 0.620034
C  -4.620198 0.341437 0.374452
C  -1.455954 0.040865 -1.988054
C  -4.237309 -0.779013 1.364447
C  -1.13663 -1.339658 0.645697
C  -2.002462 -2.844715 -1.109442
C  -0.192932 0.334902 -1.140958
C  0.020123 -0.573556 0.063715
C  -2.788697 2.921884 0.377408
C  -3.194538 3.097286 -1.098967
C  1.227376 -0.749099 0.709784
C  2.55263 -0.169346 0.475143
C  2.829554 1.003373 -0.300155
C  3.667045 -0.803033 1.103132
C  4.136995 1.488475 -0.451186
C  4.986452 -0.336342 0.952717
C  5.225584 0.818041 0.163635
C  7.645121 0.738838 0.56093
H  -3.467314 -0.731343 -1.895282
H  -3.308871 -2.751308 1.346147
H  -4.378836 -2.428787 -0.050738
H  -5.392087 -0.013813 -0.335725
H  -5.042448 1.217332 0.901622
H  -1.707611 0.929864 -2.595299
H  -1.230903 -0.768842 -2.706365
H  -5.133299 -1.106507 1.924846
H  -3.514607 -0.388132 2.104419
H  -2.801873 -3.046857 -1.847598
H  -1.052335 -2.713244 -1.655427
H  -1.896098 -3.731041 -0.458531
H  -0.260495 1.37225 -0.760172
H  0.694077 0.291091 -1.803132
H  -1.89839 3.495958 0.677487
H  -3.629845 3.142849 1.063701
H  -3.932495 3.90035 -1.262792
H  -2.309059 3.260871 -1.744975
H  1.184009 -1.463928 1.545968
H  2.013014 1.563076 -0.759291
H  3.485523 -1.690829 1.721143
H  4.343935 2.390479 -1.035311
H  5.806031 -0.863793 1.449776
H  7.560866 0.740194 1.664856
H  8.509713 1.344842 0.253586
H  7.768413 -0.299846 0.197993
