program: Gaussian 09
title: 000287569
version: EM64L-G09RevD.01
frameworkgroup: C1[X(C12H20O3S)]
method: RPBEPBE
basis: SDD
operation: Freq
keyword: #p
keyword: freq=noraman
keyword: PBEPBE/SDD
title: #p freq=noraman PBEPBE/SDD
converged: YES YES NO NO
title: Mulliken charges:
elementType: S O O O C C C C C C C C C C C C H H H H H H H H H H H H H H H H H H H H
charge: 0.185538 -0.271360 -0.181637 -0.249968 0.317767 -0.129625 0.206308 -0.772503 0.180915 -0.747311 -0.719301 -0.722916 -0.710770 -0.713083 0.314245 -0.764183 0.242822 0.260863 0.253791 0.249412 0.264831 0.213126 0.211783 0.251096 0.203285 0.242827 0.246673 0.203917 0.248991 0.231856 0.237434 0.212838 0.251635 0.262318 0.244687 0.243701
chargesum: 0.00000
title: Mulliken charges with hydrogens summed into heavy atoms:
elementType: S O O O C C C C C C C C C C C C
charge: 0.185538 -0.271360 -0.181637 -0.249968 0.317767 0.113198 0.206308 -0.257849 0.180915 -0.233069 -0.043297 -0.030131 -0.026006 -0.011177 0.314245 -0.013477
polarizability: 1.64173380e+02 3.37565931e+00 1.65051936e+02 1.66684210e+00 3.48842313e+00 1.25942011e+02
1716.lowfreq: -12.7319 -7.1597 -0.0015 -0.0009 0.0015 11.9471 34.5679 54.2379 68.5798
frequency: 34.3327 54.1923 68.5660 81.6713 89.1850 129.5106 138.0906 177.4250 186.7331 191.7743 208.8340 218.2238 229.5039 245.3006 263.0078 268.6691 284.0945 300.8379 316.1953 339.3228 347.9665 366.4310 400.1013 413.1244 439.7278 459.6852 530.0356 555.5995 567.7097 622.3416 660.3875 691.4817 719.5985 788.4279 796.7492 829.9664 849.5197 865.4310 897.9177 918.3570 934.7591 944.6385 947.2058 959.5935 972.8394 997.9472 1007.8128 1011.0286 1040.4799 1042.1055 1104.3882 1119.5073 1146.4111 1154.7863 1198.4546 1210.4028 1231.4496 1248.1627 1252.4466 1272.0376 1277.5554 1296.4314 1318.1407 1375.3291 1376.6669 1382.9517 1391.4671 1395.7538 1423.3630 1435.3045 1452.9074 1453.5108 1457.3401 1460.5204 1465.1319 1468.5868 1473.8900 1478.8525 1487.5730 1490.8656 1614.0732 1645.5718 2978.3848 2984.1891 2986.5671 2987.3208 2996.6071 3001.7905 3006.7696 3008.7597 3065.9703 3077.1766 3080.2195 3081.5035 3082.3494 3085.0015 3099.2908 3100.5698 3102.3919 3106.8413 3108.5673 3141.5021
redmass: 4.7309 4.1381 1.8384 1.7726 4.3329 3.5352 3.8622 4.3293 1.8949 1.2601 1.6014 2.0529 1.2941 2.2958 1.8618 1.3898 2.9534 2.7867 3.5680 3.4154 2.8048 3.6273 2.5508 3.0767 2.8384 2.8861 3.5468 3.6058 3.6934 5.3309 5.6801 4.4294 5.2756 3.1583 4.1581 2.1750 2.5778 5.3618 1.9036 1.9859 1.9755 1.5365 1.9660 2.1707 2.2755 1.8130 1.3232 1.4683 2.4037 1.6576 1.5088 1.9291 1.8413 1.5195 2.0837 3.5432 3.4855 1.5977 1.4675 1.5998 1.6115 1.7134 1.3865 1.1762 1.1869 1.2396 1.1839 1.1917 1.0891 1.0840 1.0604 1.0532 1.0506 1.0521 1.0532 1.0504 1.0534 1.0523 1.0627 1.0595 9.6832 9.5652 1.0372 1.0353 1.0363 1.0370 1.0632 1.0779 1.0379 1.0611 1.0999 1.1026 1.1013 1.1020 1.0995 1.0996 1.0951 1.0997 1.1005 1.0988 1.0977 1.1020
irintensity: 0.9631 0.7233 3.3635 3.9307 2.1131 1.6526 0.6445 1.0301 1.9697 0.3197 0.5190 3.4263 0.1591 3.1089 0.0914 1.1766 2.5867 0.2828 3.8308 0.5399 2.2243 4.0754 0.4482 2.5896 5.2642 0.9972 3.8963 1.8283 2.3892 6.0939 2.5636 4.5099 2.5967 2.3554 4.9166 20.5606 2.6080 8.1958 5.9399 3.9273 30.8892 3.2660 42.3464 25.8755 31.7191 59.4240 1.9898 8.6132 31.0483 9.7673 5.8423 2.2643 0.9288 10.2577 107.4063 195.4105 7.9428 42.1954 10.2195 1.9668 6.4548 4.1005 6.2345 9.3495 34.5925 56.6152 28.6783 30.0928 6.2997 9.7055 25.4483 18.8700 11.1825 8.2422 7.8603 7.5227 12.0199 10.0837 23.5580 13.1333 97.7857 135.1690 23.8904 16.3537 36.0105 22.5582 23.2999 17.4716 1.5355 24.7092 20.2659 9.1091 17.8602 23.4487 22.5185 28.0205 7.5454 7.9583 12.1382 16.4133 25.1510 9.1345
temp: 298.150 k
press: 1.00000 atm
elementType: 16 8 8 8 6 6 6 6 6 6 6 6 6 6 6 6 1 1 1 1 1 1 1 1 1 1 1 1 1 1 1 1 1 1 1 1
symmnumber: 1
zpe: 783829.4 jmol-1
zpe.correction: 0.298545 hartree
zpe.thermalcorrener: 0.317230 hartree
zpe.thermalcorrenthalpy: 0.318174 hartree
zpe.thermalcorrgfe: 0.252755 hartree
zpe.sumelectzpe: -1091.741969 hartree
zpe.sumelectthermal: -1091.723284 hartree
zpe.sumelectthermalent: -1091.722339 hartree
zpe.sumelectthermalfe: -1091.787759 hartree
dipole: 0.6822 1.6544 -1.8522
dipole: 2.5754
quadrupole: -102.1591 -101.4689 -109.2146
quadrupole: 6.7055 3.5518 -0.4304
quadrupole: 2.1217 2.8120 -4.9337 6.7055 3.5518 -0.4304
hfenergy: -1092.0405137 hartree
pointgroup: C01 [X(C12H20O3S1)]
dipole: -0.216354 0.6676695 0.7308116 debye
polarizability: 163.8602661|-3.3862299|165.3804208|0.6312262|-3.6739901|125.9266403 unknown
InChI: InChI=1S/C12H20O3S/c1-8(13)15-10-9(14)11(2,3)6-16-7-12(10,4)5/h10H,6-7H2,1-5H3
charge 0 multiplicity 1
36 atoms
S  3.020824 0.705134 0.112587
O  -1.782405 0.685636 -0.030336
O  -0.358048 -0.976203 -1.623956
O  -2.312728 -1.240145 1.167017
C  0.327804 1.891007 0.014414
C  -0.344927 0.502056 0.309938
C  1.306204 -1.60921 0.051828
C  1.731004 1.963191 0.674322
C  0.18839 -0.703771 -0.526132
C  2.292065 -0.829641 0.950525
C  -0.524567 3.001037 0.70017
C  0.404491 2.158942 -1.507621
C  2.069691 -2.288961 -1.110719
C  0.593999 -2.700713 0.918949
C  -2.667103 -0.297396 0.422639
C  -4.054094 -0.054613 -0.122437
H  -0.26806 0.266087 1.390048
H  2.187912 2.9402 0.437313
H  1.653351 1.880187 1.774963
H  1.836578 -0.497867 1.901471
H  3.153787 -1.473472 1.196779
H  -0.679151 2.791857 1.775658
H  -0.010222 3.975858 0.609605
H  -1.512612 3.082818 0.220839
H  0.725375 3.201475 -1.689706
H  1.125534 1.484749 -2.00088
H  -0.582485 2.00793 -1.976667
H  2.767253 -3.047459 -0.709984
H  1.364245 -2.781192 -1.799481
H  2.648558 -1.545671 -1.688014
H  -0.039671 -3.339919 0.28057
H  1.358778 -3.336474 1.403086
H  -0.054473 -2.26034 1.695012
H  -4.100588 -0.433247 -1.15987
H  -4.285183 1.022208 -0.150384
H  -4.795228 -0.593581 0.485753
