program: Gaussian 09
title: 000287530
version: EM64L-G09RevD.01
frameworkgroup: C1[X(C17H26O3)]
method: RPBEPBE
basis: SDD
operation: Freq
keyword: #pfreq=noraman
keyword: PBEPBE/SDD
title: #p freq=noraman PBEPBE/SDD
converged: YES YES NO NO
title: Mulliken charges:
elementType: O O O C C C C C C C C C C C C C C C C C H H H H H H H H H H H H H H H H H H H H H H H H H H
charge: -0.233175 -0.243105 -0.220955 -0.383837 -0.371231 -0.371560 -0.367404 -0.353476 -0.416372 -0.356356 -0.321492 -0.696444 0.261007 0.195549 -0.312034 -0.503877 -0.405470 0.419809 -0.218864 -0.536921 0.191057 0.195925 0.185357 0.195106 0.188248 0.190105 0.182854 0.232848 0.188461 0.187624 0.193998 0.221144 0.194541 0.194873 0.221612 0.209652 0.215213 0.209807 0.209770 0.260207 0.247072 0.269928 0.156890 0.222225 0.222526 0.249166
chargesum: 0.00000
title: Mulliken charges with hydrogens summed into heavy atoms:
elementType: O O O C C C C C C C C C C C C C C C C C
charge: -0.233175 -0.243105 -0.220955 0.003144 0.009232 0.006793 0.048299 0.022609 -0.001230 0.033058 0.109772 -0.061655 0.261007 0.195549 -0.051827 -0.256805 -0.135542 0.419809 -0.061975 0.156996
polarizability: 2.91761537e+02 4.68404268e+00 1.96182434e+02 3.02477772e+01 -7.33434788e+00 1.38993257e+02
1716.lowfreq: -4.6602 -0.0004 0.0006 0.0012 2.8496 7.0779 14.4246 16.1184 38.4640
frequency: 14.2180 15.9368 37.7937 43.2296 51.9548 80.6178 89.3282 92.6014 100.1417 113.8215 117.5096 138.1696 142.5829 154.6306 160.9791 170.9660 222.3146 229.9863 241.9733 252.4588 282.5244 286.6480 295.8326 335.4561 344.1264 388.6824 429.1333 451.8462 465.4748 488.2535 520.7642 585.0798 592.2583 624.7530 721.4983 722.2943 730.9842 742.5521 755.1057 762.2128 796.5462 820.8042 849.9604 855.7221 887.9849 892.7345 901.0371 914.9600 950.9021 953.8374 989.7447 998.9870 999.2522 1001.1135 1014.3916 1049.1877 1059.3702 1079.6572 1081.6674 1090.4697 1112.6661 1118.4893 1123.9778 1145.9497 1156.0407 1177.8389 1187.6616 1203.9705 1221.1552 1224.6770 1236.8053 1260.1332 1263.3851 1270.3566 1280.4914 1285.8488 1289.3878 1293.2762 1297.8309 1305.2644 1334.9907 1352.4425 1354.4184 1357.1313 1366.9464 1368.2220 1388.2742 1404.4561 1421.6612 1443.8748 1448.9639 1460.4068 1460.7114 1464.9516 1468.2054 1469.8246 1471.2659 1471.6514 1478.2083 1478.7063 1485.1126 1488.5409 1507.2763 1570.8658 1596.5216 1619.5076 2849.6684 2948.1341 2949.8292 2952.2767 2953.2578 2958.3950 2958.8374 2964.4698 2967.4771 2971.7476 2978.7306 2983.8249 2991.1379 3003.1142 3017.2252 3020.7035 3031.6589 3038.6764 3046.3914 3056.9097 3068.8756 3070.4043 3128.2090 3140.6629 3151.5206 3172.1909
redmass: 4.5871 5.6477 1.5947 3.8184 4.1371 2.3228 2.4218 3.2015 3.2730 3.2307 5.3006 1.9416 2.2932 3.5204 3.8819 3.7412 2.5439 1.3991 1.0957 3.5077 2.1021 2.7712 3.6961 4.1738 4.4149 4.5125 3.3135 3.4544 3.2089 4.1142 3.9469 4.1520 3.9652 6.2176 1.1184 1.3330 1.2829 3.1714 1.6299 3.4861 1.4726 1.4289 1.4462 1.5443 1.9301 2.3615 2.0453 3.0737 1.5144 1.4425 1.7619 3.8177 3.1400 2.7477 1.4626 2.9570 2.2055 2.2533 2.2526 1.9928 1.2613 2.0368 2.6383 1.6804 1.3711 1.7536 1.6964 1.2658 1.7937 1.6899 1.3062 1.4411 2.4445 1.2610 1.0233 1.3977 1.4277 1.0955 1.1480 1.2666 1.4083 1.6150 1.6395 1.9499 1.6286 1.3549 1.2173 1.8702 4.6776 1.3472 1.0822 1.0724 1.0705 1.0702 1.0496 1.1394 1.0781 1.0699 1.0431 1.0799 1.0877 1.0908 2.7174 8.4830 5.6210 7.1723 1.0841 1.0588 1.0588 1.0592 1.0553 1.0334 1.0599 1.0640 1.0593 1.0364 1.0633 1.0959 1.0976 1.1008 1.1033 1.1038 1.1002 1.1042 1.1040 1.1027 1.1007 1.0993 1.0990 1.0904 1.0878 1.0958
irintensity: 0.5013 0.3126 0.1790 0.1303 0.1914 1.0128 0.3924 0.6098 2.6485 4.9933 10.7967 0.8974 0.4515 2.3472 1.7211 1.0064 3.4676 1.9519 0.0084 4.6464 3.4013 0.1953 0.1493 2.6296 2.8481 1.7038 0.4363 0.1261 0.8827 0.7975 1.6952 22.5550 8.4914 18.2466 14.4084 4.1312 2.3322 0.6215 18.3379 31.8622 0.6417 45.6143 1.7892 23.5574 3.5393 9.5521 6.5261 20.5430 20.1251 8.2432 8.5581 33.4383 9.7767 27.1567 1.0431 7.8151 18.0838 1.0887 2.5170 4.5000 0.1339 209.4935 10.6953 3.4179 6.0653 62.9586 0.6357 12.0300 22.2739 16.8159 1.3309 92.6373 364.4265 0.8528 0.7950 40.2487 71.7685 0.2498 4.9855 4.3268 0.8070 0.9732 0.2479 16.9627 0.6051 12.1838 11.2374 35.6433 10.2309 11.9591 8.2127 0.0313 0.1289 0.1111 13.2345 88.3354 3.0561 17.7850 12.1628 1.9947 3.2030 30.2069 105.3075 238.2890 243.1469 76.0914 140.5108 3.1504 3.0331 0.0040 31.1597 59.5665 16.5090 15.2094 162.5952 38.4973 47.2750 3.4366 4.0295 3.0606 21.5333 13.8741 36.1507 76.5332 46.6530 107.9914 97.6172 56.1568 20.9639 8.0936 2.3043 10.4320
temp: 298.150 k
press: 1.00000 atm
elementType: 8 8 8 6 6 6 6 6 6 6 6 6 6 6 6 6 6 6 6 6 1 1 1 1 1 1 1 1 1 1 1 1 1 1 1 1 1 1 1 1 1 1 1 1 1 1
symmnumber: 1
zpe: 1033260.7 jmol-1
zpe.correction: 0.393548 hartree
zpe.thermalcorrener: 0.416438 hartree
zpe.thermalcorrenthalpy: 0.417382 hartree
zpe.thermalcorrgfe: 0.337825 hartree
zpe.sumelectzpe: -887.486260 hartree
zpe.sumelectthermal: -887.463370 hartree
zpe.sumelectthermalent: -887.462426 hartree
zpe.sumelectthermalfe: -887.541984 hartree
dipole: -4.2670 0.8186 -1.5088
dipole: 4.5993
quadrupole: -167.1508 -102.4866 -126.3603
quadrupole: 12.8946 -11.5660 -2.4032
quadrupole: -35.1516 29.5127 5.6389 12.8946 -11.5660 -2.4032
hfenergy: -887.8798086 hartree
pointgroup: C01 [X(C17H26O3)]
dipole: -1.6942327 0.1429174 -0.6192933 debye
polarizability: 292.9235413|12.5550151|188.121521|24.4375214|-21.502508|145.892165 unknown
InChI: InChI=1S/C17H26O3/c1-3-4-5-6-7-8-9-12-20-16-11-10-15(14-18)13-17(16)19-2/h10-11,13-14H,3-9,12H2,1-2H3
charge 0 multiplicity 1
46 atoms
O  1.06319 -0.815441 -0.43043
O  1.8385 1.514476 -1.39596
O  7.309765 0.285109 1.146958
C  -4.220138 -0.200649 0.452317
C  -3.294607 -1.280103 -0.152405
C  -5.697885 -0.354751 0.026879
C  -1.820104 -1.131304 0.2835
C  -6.625814 0.723995 0.629514
C  -0.907117 -2.216999 -0.326991
C  -8.105158 0.562309 0.210794
C  0.556261 -2.102563 0.102205
C  -9.02621 1.643266 0.816794
C  2.378353 -0.466451 -0.158853
C  2.807657 0.801202 -0.684157
C  3.289185 -1.263209 0.580855
C  4.127193 1.230509 -0.456207
C  4.606929 -0.823312 0.802579
C  5.035841 0.423348 0.28748
C  6.414598 0.905985 0.507496
C  2.236535 2.812528 -1.946937
H  -4.152494 -0.238326 1.559902
H  -3.854598 0.803816 0.15338
H  -3.666969 -2.285344 0.138551
H  -3.355352 -1.234648 -1.260023
H  -6.062181 -1.359787 0.327287
H  -5.765993 -0.318728 -1.080793
H  -1.758546 -1.179545 1.391376
H  -1.439497 -0.13511 -0.011833
H  -6.267715 1.729637 0.324263
H  -6.554796 0.692933 1.73716
H  -1.267469 -3.223088 -0.028233
H  -0.957478 -2.17232 -1.432184
H  -8.461548 -0.442813 0.516389
H  -8.175681 0.592936 -0.89592
H  1.165406 -2.930871 -0.313428
H  0.651704 -2.100245 1.208037
H  -10.077308 1.503535 0.503418
H  -8.71088 2.655472 0.500012
H  -8.99658 1.614742 1.922523
H  2.968485 -2.227784 0.983585
H  4.474237 2.193343 -0.847521
H  5.320747 -1.428051 1.371314
H  6.635404 1.907106 0.052244
H  2.537203 3.515561 -1.145529
H  3.062672 2.704606 -2.676842
H  1.339051 3.192131 -2.456166
