program: Gaussian 09
title: 000287562
version: EM64L-G09RevD.01
frameworkgroup: C1[X(C16H12N2O6S2)]
method: RPBEPBE
basis: SDD
operation: Freq
keyword: #p
keyword: freq=noraman
keyword: PBEPBE/SDD
title: #p freq=noraman PBEPBE/SDD
converged: NO YES NO NO
title: Mulliken charges:
elementType: S S O O O O O O N N C C C C C C C C C C C C C C C C H H H H H H H H H H H H
charge: 0.910691 0.934581 -0.484135 -0.485218 -0.471734 -0.492331 -0.236686 -0.229203 -0.441541 -0.440021 -0.380555 -0.347081 -0.110314 -0.127113 0.340591 0.308778 0.282830 0.269762 -0.252811 -0.251370 -0.335007 -0.324247 -0.210968 -0.208688 -0.202012 -0.203758 0.300887 0.254303 0.262689 0.278176 0.272121 0.272927 0.279145 0.281994 0.247578 0.249200 0.242844 0.245695
chargesum: 0.00000
title: Mulliken charges with hydrogens summed into heavy atoms:
elementType: S S O O O O O O N N C C C C C C C C C C C C C C C C
charge: 0.910691 0.934581 -0.484135 -0.485218 -0.471734 -0.492331 -0.236686 -0.229203 -0.441541 -0.440021 0.174635 0.193784 -0.110314 -0.127113 0.340591 0.308778 0.282830 0.269762 0.019310 0.021558 -0.055863 -0.042254 0.036610 0.040513 0.040831 0.041937
polarizability: 2.81460042e+02 -1.25963994e+01 2.62993871e+02 4.47875641e+01 5.92385545e+00 2.01374361e+02
1716.lowfreq: -5.8495 -0.0016 -0.0009 -0.0006 3.3612 8.8624 19.4755 24.5028 38.4458
frequency: 19.3693 24.4896 38.3429 55.5867 73.2526 75.2888 91.3549 99.2637 106.1514 126.2000 145.7676 148.8457 180.0382 185.7588 195.0634 225.0170 233.2088 272.4023 283.1024 291.7447 293.5946 306.4648 311.9793 344.4842 374.5387 411.7179 417.9890 420.3048 423.6861 427.1545 444.0102 445.2189 486.3741 497.7296 500.7751 509.3195 547.3381 642.5024 646.1116 653.6665 657.6901 676.1848 681.2461 738.7954 741.8967 780.6694 782.4036 788.5862 794.4881 833.1590 835.3211 870.0364 888.6923 889.6245 893.3457 949.0798 952.3870 969.2291 969.4329 978.0410 994.2955 1005.5015 1006.2221 1009.1895 1009.2674 1029.3448 1033.2030 1093.7644 1112.5372 1113.6123 1170.3721 1171.1688 1188.2046 1192.1054 1247.2313 1260.3087 1265.7082 1273.1292 1314.9589 1329.5197 1340.9467 1352.7409 1396.9833 1397.5587 1431.9335 1432.1587 1441.9628 1446.8074 1451.6180 1453.7608 1581.6449 1582.6623 1601.4113 1604.5425 1618.4463 1620.5660 3004.6955 3011.1050 3070.7998 3083.3363 3146.8493 3148.1110 3159.4686 3160.1652 3170.1055 3170.6735 3180.1467 3180.7165
redmass: 7.6113 8.0874 7.7826 7.3443 8.2524 9.7895 10.1760 7.9584 10.1059 8.5856 6.6289 7.1671 7.3150 8.1292 4.6417 6.0986 4.5574 6.1437 5.9879 7.5169 9.1913 4.7236 6.4664 6.0479 5.5030 4.6195 4.4300 6.4352 4.5179 11.0022 13.7777 12.4279 4.2902 4.6836 4.8704 6.6115 3.1921 6.2887 6.2782 4.7394 4.8019 6.6552 6.4202 3.2449 2.9874 1.4906 1.5293 4.2609 5.0029 12.3554 11.7079 4.3056 1.3565 1.3672 3.0081 19.7106 19.5912 1.4003 1.3936 3.9370 3.9692 4.8012 4.2172 1.3708 1.3627 2.1796 2.3211 2.6818 1.6372 1.6447 1.2257 1.1817 2.0711 2.3513 1.5101 1.5312 1.4797 1.3138 3.4768 2.3047 1.5868 1.2806 9.2157 9.3495 2.2469 2.2663 1.1339 1.4500 2.3541 1.6433 6.8606 6.8994 9.0176 8.9084 8.7283 9.2226 1.0599 1.0612 1.1043 1.1029 1.0867 1.0868 1.0905 1.0906 1.0957 1.0957 1.1007 1.1007
irintensity: 0.8277 0.3366 1.8211 5.3878 0.1995 0.9733 0.8489 0.4637 1.9999 0.4566 3.1574 0.5407 10.3100 6.7510 1.2734 3.1238 4.6468 8.3511 13.1588 7.6950 12.6525 5.3494 4.7575 1.5494 13.6273 0.9827 17.7496 39.9688 19.3416 72.8706 35.8930 18.1782 11.1662 6.3656 18.4343 0.1403 10.4272 2.4804 1.5387 39.4964 18.0073 10.1345 13.5353 29.7373 32.5502 44.7654 39.9364 8.1829 11.9781 53.6700 147.1337 5.9601 0.8338 2.3734 2.6698 165.5740 46.0768 1.3012 0.3125 9.2880 12.5534 0.8110 2.5534 0.3508 0.4846 3.3738 6.0153 4.3451 18.4523 12.5513 2.6149 2.7196 2.3033 2.8020 28.1805 14.7317 2.5261 5.8091 186.1893 159.0297 92.2392 9.4892 2.1449 2.8764 18.3863 13.7944 43.3257 17.3584 21.6281 19.0982 18.7435 17.8850 59.6289 104.4187 46.0745 115.1724 4.0095 19.6739 3.5273 0.4527 2.7004 2.8534 3.3182 2.6728 1.0169 0.5522 15.1033 15.0674
temp: 298.150 k
press: 1.00000 atm
elementType: 16 16 8 8 8 8 8 8 7 7 6 6 6 6 6 6 6 6 6 6 6 6 6 6 6 6 1 1 1 1 1 1 1 1 1 1 1 1
symmnumber: 1
zpe: 674138.0 jmol-1
zpe.correction: 0.256766 hartree
zpe.thermalcorrener: 0.280406 hartree
zpe.thermalcorrenthalpy: 0.281351 hartree
zpe.thermalcorrgfe: 0.202373 hartree
zpe.sumelectzpe: -1971.695489 hartree
zpe.sumelectthermal: -1971.671849 hartree
zpe.sumelectthermalent: -1971.670904 hartree
zpe.sumelectthermalfe: -1971.749882 hartree
dipole: -2.6604 6.7301 -1.2628
dipole: 7.3462
quadrupole: -138.9549 -147.6815 -183.3524
quadrupole: 4.7539 2.3803 2.9442
quadrupole: 17.7080 8.9814 -26.6895 4.7539 2.3803 2.9442
hfenergy: -1971.9522549 hartree
pointgroup: C01 [X(C16H12N2O6S2)]
dipole: 0.8976873 -2.7355292 -0.2536389 debye
polarizability: 277.7888703|-18.0851265|263.1015088|-45.4268321|-9.126891|204.9378952 unknown
InChI: InChI=1S/C16H12N2O6S2/c19-15-11-5-1-3-7-13(11)25(21,22)17(15)9-10-18-16(20)12-6-2-4-8-14(12)26(18,23)24/h1-8H,9-10H2
charge 0 multiplicity 1
38 atoms
S  -2.957489 1.493141 0.317925
S  1.310806 0.302799 1.520039
O  -2.425712 2.043571 1.74935
O  -4.106591 2.351635 -0.437566
O  1.672764 1.048158 2.910482
O  -0.04734 -0.585444 1.453352
O  -0.350396 -0.494053 -1.962305
O  2.602321 1.956639 -1.879463
N  -1.488171 1.228659 -0.84469
N  1.386289 1.533069 0.072442
C  -0.622469 2.365771 -1.15745
C  0.431909 2.63838 -0.050796
C  -3.278203 -0.362052 0.243556
C  2.779357 -0.593407 0.748364
C  -2.332324 -0.980431 -0.589592
C  3.166122 0.036428 -0.445929
C  -1.282271 -0.10263 -1.20523
C  2.387734 1.250745 -0.853418
C  -4.311928 -1.028115 0.904677
C  3.393399 -1.729329 1.280633
C  -2.418748 -2.373606 -0.780384
C  4.245213 -0.506224 -1.17279
C  -4.385056 -2.430524 0.703162
C  4.479611 -2.26262 0.539563
C  -3.449031 -3.091194 -0.130327
C  4.896327 -1.657222 -0.672021
H  -0.115402 2.146773 -2.113826
H  -1.246584 3.268655 -1.297037
H  0.996479 3.554069 -0.309266
H  -0.061686 2.797062 0.924208
H  -5.026945 -0.506476 1.547112
H  3.06141 -2.188595 2.216079
H  -1.682307 -2.865227 -1.423723
H  4.549974 -0.023576 -2.106709
H  -5.173891 -3.003682 1.200704
H  4.99788 -3.152089 0.911716
H  -3.524496 -4.174332 -0.269911
H  5.735051 -2.088131 -1.227929
