program: Gaussian 09
title: 000287424
version: EM64L-G09RevD.01
frameworkgroup: C1[X(C9H12O)]
method: RPBEPBE
basis: SDD
operation: Freq
keyword: #pfreq=noraman
keyword: PBEPBE/SDD
title: #p freq=noraman PBEPBE/SDD
converged: YES YES NO NO
title: Mulliken charges:
elementType: O C C C C C C C C C H H H H H H H H H H H H
charge: -0.243644 0.091818 0.180624 -0.179201 -0.703454 -0.703351 0.480572 -0.565157 -0.369178 -0.800072 0.233170 0.209838 0.255248 0.227490 0.255260 0.209863 0.227522 0.258076 0.230696 0.234183 0.234178 0.235519
chargesum: 0.00000
title: Mulliken charges with hydrogens summed into heavy atoms:
elementType: O C C C C C C C C C
charge: -0.243644 0.091818 0.180624 0.053969 -0.010878 -0.010706 0.480572 -0.307082 -0.138482 -0.096191
polarizability: 1.26913173e+02 -5.05146191e+00 1.03314642e+02 -6.33552132e-04 1.40651771e-03 6.63830507e+01
1716.lowfreq: -0.0011 -0.0009 -0.0005 6.1435 15.8361 17.8129 45.6199 135.5884 181.7526
frequency: 45.5191 135.5715 181.7476 201.5919 219.9183 249.1328 252.0760 278.0102 293.4313 319.8984 430.8061 447.3130 495.5945 540.0616 595.7551 655.7982 707.4499 716.9855 777.5415 865.3165 891.6188 936.2279 943.9827 950.3296 977.6278 1005.0659 1012.1213 1045.1275 1101.3579 1131.4170 1171.5620 1185.3143 1215.2504 1302.8596 1318.1811 1364.0024 1378.0757 1394.2447 1415.1518 1455.1667 1462.4423 1465.0127 1466.9740 1472.2098 1487.9650 1552.3551 1578.1777 1651.7243 2971.3557 2979.5459 2980.7172 3044.6017 3078.6503 3082.2557 3091.8879 3093.9900 3097.2187 3099.8904 3128.9221 3139.9398
redmass: 3.3334 1.2839 2.3831 1.3046 2.1034 2.5750 1.0789 2.9701 2.4167 3.3545 2.2905 3.7446 4.4078 5.6568 3.1630 5.3074 4.4107 2.9812 1.4328 2.2433 1.4586 1.9394 1.5023 2.3163 1.2993 1.3050 1.5768 1.6010 3.8499 1.8851 2.3192 1.5367 1.9894 2.5094 1.9091 1.1648 1.2887 1.2271 1.9616 1.0491 1.0465 1.1003 1.0489 1.0747 1.0770 7.6289 7.2471 6.4360 1.0383 1.0337 1.0339 1.0963 1.1009 1.1000 1.0861 1.1011 1.1003 1.0983 1.0974 1.0926
irintensity: 2.6712 0.0797 1.1269 0.0418 0.6429 1.6294 0.6693 3.8052 1.5657 5.0460 7.9719 3.3157 1.0921 3.5696 3.5126 5.6332 0.7739 5.3903 37.8525 1.9844 12.2677 14.1526 2.4062 1.1187 0.6320 2.0177 12.9597 14.6038 0.6215 6.2059 2.2018 20.6130 17.6880 18.5655 12.2083 11.3163 25.4431 33.9541 10.7900 7.5974 14.5816 16.1562 3.2693 18.3489 13.7484 165.6593 18.0878 89.1803 16.8530 27.6287 30.1477 15.9700 14.2734 30.7289 16.9466 7.5097 15.0935 14.6329 34.2592 5.8725
temp: 298.150 k
press: 1.00000 atm
elementType: 8 6 6 6 6 6 6 6 6 6 1 1 1 1 1 1 1 1 1 1 1 1
symmnumber: 1
zpe: 481676.6 jmol-1
zpe.correction: 0.183461 hartree
zpe.thermalcorrener: 0.193887 hartree
zpe.thermalcorrenthalpy: 0.194831 hartree
zpe.thermalcorrgfe: 0.148187 hartree
zpe.sumelectzpe: -424.606237 hartree
zpe.sumelectthermal: -424.595811 hartree
zpe.sumelectthermalent: -424.594867 hartree
zpe.sumelectthermalfe: -424.641511 hartree
dipole: 2.2663 -3.5527 0.0016
dipole: 4.2140
quadrupole: -53.9832 -64.7825 -61.3519
quadrupole: 5.4532 -0.0021 0.0019
quadrupole: 6.0560 -4.7433 -1.3127 5.4532 -0.0021 0.0019
hfenergy: -424.789698 hartree
pointgroup: C01 [X(C9H12O1)]
dipole: 0.9262358 1.3750378 0.0019966 debye
dipolederiv: -0.7379523 -0.3440033 -0.0004842 -0.2657576 -0.8591938 -0.0003875 -0.0008631 -0.0011175 -0.3599461 -0.2230794 0.2089116 -0.0002257 0.1217928 -0.2522463 -0.0001831 -0.0009214 0.0005899 -0.0096771 1.0670536 0.455004 0.0012439 -0.0359604 0.7797109 0.0001985 0.0009104 0.0009204 0.1069128 0.259302 -0.1651198 0.0005492 0.1641644 0.0232366 0.0007105 0.0009507 -0.0000188 -0.1889075 0.0584633 -0.0593487 0.0285917 -0.0880706 0.0849186 -0.0006067 -0.0723328 0.0559788 0.0684065 0.0581501 -0.0589571 -0.0287839 -0.0884161 0.0850222 0.0003313 0.0726537 -0.0564119 0.0683654 0.6698512 -0.0364318 0.0003844 -0.0014706 0.4588442 0.0004614 0.0004843 0.0007296 0.0061114 -0.7269524 -0.4353803 -0.0009157 -0.0868565 -0.1638346 0.0000156 -0.0004241 -0.0003134 -0.1583272 -0.3226247 0.3589509 0.0002164 0.1760245 -0.0042046 0.0004785 0.000172 0.000482 -0.1830626 -0.2998408 -0.00166 -0.0002611 -0.0848094 0.0309903 -0.0001029 -0.0004433 0.0000049 0.0450711 0.0412442 0.0889129 0.0000374 0.0459993 -0.1032764 -0.0003412 -0.0000266 -0.0002994 0.1255027 0.0220676 0.093806 0.0332153 0.1417305 -0.0980132 -0.0140764 0.0021276 0.0273658 0.0623747 -0.0077511 -0.0448425 0.0299656 -0.1234543 0.008146 0.0109199 0.0119996 -0.0345662 0.0839051 0.0256703 0.0005851 -0.1246173 0.0103945 0.084797 0.0059227 -0.0679151 0.0042105 -0.0977677 -0.0076771 -0.0448475 -0.0303844 -0.1233035 0.0081177 -0.0114173 -0.0127652 0.0342885 0.0837609 0.0222263 0.0939719 -0.0332095 0.141612 -0.0979582 0.0142624 -0.0020671 -0.0272139 0.0622208 0.024963 0.0003665 0.1250712 0.0102664 0.084776 -0.0055919 0.0684471 -0.0039043 -0.0969358 0.0133781 0.0592151 0.0000048 0.0910508 -0.0429082 -0.0002177 0.0000904 -0.0002567 0.1604204 -0.0262071 -0.1119068 -0.0003295 -0.0906166 -0.0415153 -0.000396 -0.0002836 -0.0003862 0.1712579 0.0189411 -0.0328848 -0.0473719 -0.0166084 0.0640324 -0.1021907 -0.0995737 -0.0873074 -0.03031 0.0187778 -0.0331565 0.0473279 -0.0170568 0.0634633 0.102459 0.0996333 0.0875517 -0.029594 0.0519962 0.0088151 -0.0000245 0.1193455 -0.1129046 -0.0002484 0.0001469 -0.0003263 0.1102183 unknown
polarizability: 127.1504449|4.4564603|103.0772477|0.0560613|0.054813|66.383173 unknown
InChI: InChI=1S/C9H12O/c1-7-4-5-9(2,3)8(10)6-7/h4-6H,1-3H3
charge 0 multiplicity 1
22 atoms
O  -1.290317 -2.017342 -0.004469
C  -1.155668 0.424713 -0.001336
C  -0.52692 -0.996085 -0.00191
C  -0.135983 1.542527 0.001453
C  -2.058383 0.545292 1.269217
C  -2.053421 0.547798 -1.275348
C  1.775664 -0.029872 0.000516
C  0.933791 -1.125897 -0.001622
C  1.213643 1.329634 0.00222
C  3.282617 -0.173234 0.001194
H  -0.537483 2.566189 0.0027
H  -2.613543 1.501612 1.259763
H  -2.777505 -0.292182 1.274125
H  -1.457844 0.498327 2.19512
H  -2.772682 -0.289532 -1.284545
H  -2.608438 1.504203 -1.266345
H  -1.449254 0.502403 -2.198966
H  1.330042 -2.148368 -0.002906
H  1.911463 2.176687 0.004051
H  3.722063 0.320044 0.890061
H  3.723113 0.322685 -0.88568
H  3.596547 -1.229602 -0.000191
