program: Gaussian 09
title: 000287427
version: EM64L-G09RevD.01
frameworkgroup: C1[X(C9H10Cl2O)]
method: RPBEPBE
basis: SDD
operation: Freq
keyword: #p
keyword: freq=noraman
keyword: PBEPBE/SDD
title: #p freq=noraman PBEPBE/SDD
converged: YES YES NO NO
title: Mulliken charges:
elementType: Cl Cl O C C C C C C C C C H H H H H H H H H H
charge: 0.023034 0.004524 -0.229107 0.108031 0.206237 -0.148822 -0.632640 -0.684562 0.481361 -0.557390 -0.350099 -0.798664 0.261656 0.372525 0.252463 0.236251 0.242282 0.263481 0.234965 0.236080 0.241084 0.237311
chargesum: 0.00000
title: Mulliken charges with hydrogens summed into heavy atoms:
elementType: Cl Cl O C C C C C C C C C
charge: 0.023034 0.004524 -0.229107 0.108031 0.206237 0.112834 -0.260115 0.046434 0.481361 -0.293910 -0.115134 -0.084189
polarizability: 1.40851076e+02 -1.41770045e+01 9.99640821e+01 5.01412443e+00 9.78593207e+00 1.08927039e+02
1716.lowfreq: -11.5555 -7.2165 -0.0036 -0.0023 -0.0013 7.2823 42.1642 60.6708 120.8292
frequency: 42.1274 60.6659 120.8272 136.9477 155.6562 182.0140 215.5716 232.9196 253.8265 270.6149 274.4152 304.4123 338.3932 431.8338 463.9875 503.5552 540.3595 586.9486 654.5522 670.3567 683.1565 726.7535 741.8957 783.3201 881.2441 888.0260 949.6291 967.0658 984.9832 1010.4981 1027.0371 1044.3313 1101.6552 1166.5584 1174.3096 1189.0095 1201.3433 1239.6633 1290.8153 1320.6282 1375.2385 1394.5582 1412.3857 1459.6199 1462.4450 1464.8709 1469.6041 1554.6329 1582.3949 1657.8382 2974.2260 2992.2169 3047.8929 3096.7124 3101.8829 3111.7638 3115.6580 3132.1331 3142.2233 3147.8346
redmass: 4.9069 10.2626 1.1515 10.1083 4.9540 3.0007 4.9768 2.9263 1.3993 2.9567 5.2485 3.1095 5.1101 3.7066 3.5778 5.7801 6.1535 3.4047 5.9283 4.9823 5.1369 4.0149 4.3657 1.4714 2.2840 1.5856 1.9122 1.6075 1.3277 1.5790 6.0735 1.6083 1.8101 2.5922 2.6351 1.1264 1.1503 1.6665 2.1427 1.7788 1.2269 1.2209 2.0459 1.0469 1.1004 1.0619 1.0603 9.0751 7.1601 6.5202 1.0384 1.0335 1.0961 1.1008 1.0983 1.1011 1.0854 1.0884 1.0978 1.0939
irintensity: 1.1336 1.5607 0.6370 2.9996 1.0941 0.5569 0.5001 0.8483 0.4204 1.2522 5.4932 4.2447 7.8475 5.2075 2.5021 8.3008 21.6823 6.5110 8.0557 18.9009 77.1708 24.2219 32.0549 47.0275 28.4448 13.4046 24.8957 7.5190 1.2134 12.2496 10.5213 14.3648 2.2219 5.4497 3.6459 14.1374 13.4898 29.7140 30.3482 4.4029 18.9112 31.4729 24.8506 16.3436 16.5516 18.2454 10.9556 177.4124 27.2304 87.1246 11.3221 12.7667 12.6721 11.7481 16.7438 7.4472 2.5908 2.7101 16.5866 5.0071
temp: 298.150 k
press: 1.00000 atm
elementType: 17 17 8 6 6 6 6 6 6 6 6 6 1 1 1 1 1 1 1 1 1 1
symmnumber: 1
zpe: 433694.4 jmol-1
zpe.correction: 0.165185 hartree
zpe.thermalcorrener: 0.177801 hartree
zpe.thermalcorrenthalpy: 0.178745 hartree
zpe.thermalcorrgfe: 0.125737 hartree
zpe.sumelectzpe: -1343.381743 hartree
zpe.sumelectthermal: -1343.369128 hartree
zpe.sumelectthermalent: -1343.368184 hartree
zpe.sumelectthermalfe: -1343.421191 hartree
dipole: 3.3607 -0.2530 -3.3362
dipole: 4.7422
quadrupole: -77.1698 -87.2736 -87.8347
quadrupole: -5.5127 -2.0846 -2.1654
quadrupole: 6.9229 -3.1809 -3.7420 -5.5127 -2.0846 -2.1654
hfenergy: -1343.5469282 hartree
pointgroup: C01 [X(C9H10Cl2O1)]
dipole: 1.344852 0.8053052 1.0118211 debye
dipolederiv: -0.250329 0.0134756 0.0892347 -0.0175353 -0.1557995 0.202844 0.075186 0.1226519 -0.6397669 -0.5846783 0.1652423 0.166777 0.2827333 -0.2295427 -0.1050688 0.1686464 -0.0498024 -0.3014229 -0.6252388 -0.2762647 -0.0901146 -0.2153163 -0.9264238 -0.1993305 -0.0353914 -0.1699067 -0.3954192 -0.2989543 0.1453852 0.1760927 0.1947985 -0.2341069 -0.012492 0.245529 -0.1183285 -0.2315899 0.9793788 0.5169152 0.0812032 -0.000877 0.8819868 0.2745653 -0.1872099 0.2330615 0.2358545 0.1661583 -0.0530586 -0.0928957 0.1997254 -0.0097425 -0.011598 -0.007554 0.0685194 -0.1198476 1.0182426 -0.2818541 -0.2730095 -0.323819 0.3474718 -0.0898184 -0.2131806 -0.1242501 1.0130081 -0.0312744 0.0177413 -0.0757882 -0.0285292 0.0421372 -0.0055743 -0.1137271 0.0274167 0.068535 0.7074041 0.0608096 -0.0750258 0.1186407 0.422242 0.1344979 -0.0538866 0.1222511 0.0651144 -0.6142301 -0.5203374 -0.1403244 -0.2034175 -0.3747397 -0.0396442 -0.0104836 0.0208919 -0.1415117 -0.3967356 0.2273758 0.1042942 0.0838018 0.1212805 0.071186 0.0123175 0.0455402 -0.1578416 -0.2711998 -0.0947802 0.0156029 -0.1906541 -0.0240318 0.0086393 -0.0039013 -0.0005838 0.0378665 0.050166 0.0704321 0.052078 0.0308888 0.0065924 -0.0380613 0.0537539 -0.0422313 0.1196511 0.0042281 0.0534263 0.0504306 -0.0402202 0.0222384 -0.0112965 0.0102433 0.0366093 -0.0091212 0.0481239 -0.0597736 0.0240427 -0.1066296 -0.0157509 0.0007479 0.0134982 -0.0563394 0.062991 -0.0343105 0.0301434 -0.1091592 0.0245393 0.0806094 0.0219652 -0.0933158 0.0344233 0.0067005 0.0385521 0.0495318 0.0924927 0.0794101 0.0168771 -0.0621962 0.0593189 -0.0279419 0.0454634 -0.0230406 0.052398 0.0344271 0.0675985 0.0319096 -0.0561424 0.0510057 -0.0575028 0.1350457 0.0269984 -0.087048 -0.0115806 -0.0728378 -0.0557523 -0.0588205 0.002116 -0.0583892 0.1440985 0.0260981 -0.0400545 -0.0374041 -0.0037358 0.1083084 -0.0686232 -0.0823757 -0.0638736 -0.0640732 0.0497829 -0.0218553 -0.0032707 -0.0151486 -0.0098228 0.1105924 0.0545717 0.1128458 0.0390243 0.0148581 0.0321499 0.021897 0.136584 -0.0459407 -0.0663716 0.0548395 -0.0550615 0.0872415 unknown
polarizability: 143.3435947|4.3209364|112.3274793|-9.5317071|7.3299746|94.071123 unknown
InChI: InChI=1S/C9H10Cl2O/c1-6-3-4-9(2,8(10)11)7(12)5-6/h3-5,8H,1-2H3
charge 0 multiplicity 1
22 atoms
Cl -1.51284 0.76164 -2.178107
Cl -3.390272 1.04324 0.20954
O  -0.352004 -2.308854 -0.563961
C  -0.784536 -0.101033 0.404649
C  0.152842 -1.195487 -0.210712
C  -0.112284 1.233073 0.64366
C  -2.006239 0.013377 -0.530724
C  -1.23375 -0.687678 1.790886
C  2.113048 0.32188 0.043156
C  1.582122 -0.909345 -0.293265
C  1.234498 1.404895 0.509983
C  3.591507 0.614323 -0.07522
H  -0.760939 2.055813 0.969374
H  -2.434571 -0.970611 -0.761809
H  -1.741457 -1.655842 1.6328
H  -0.345616 -0.85599 2.424176
H  -1.915032 0.007955 2.307143
H  2.216523 -1.720125 -0.668811
H  1.690778 2.376895 0.733875
H  4.00777 0.933065 0.9000
H  3.767346 1.448731 -0.781664
H  4.160704 -0.261422 -0.426166
