program: Gaussian 09
title: 000287485
version: EM64L-G09RevD.01
frameworkgroup: C1[X(C19H32O2)]
method: RPBEPBE
basis: SDD
operation: Freq
keyword: #pfreq=noraman
keyword: PBEPBE/SDD
title: #p freq=noraman PBEPBE/SDD
converged: YES YES NO NO
title: Mulliken charges:
elementType: O O C C C C C C C C C C C C C C C C C C C H H H H H H H H H H H H H H H H H H H H H H H H H H H H H H H H
charge: -0.251421 -0.244327 -0.385525 -0.384690 -0.385728 -0.382146 -0.377192 -0.372553 -0.357980 -0.353274 -0.369678 -0.356703 -0.347830 -0.696795 0.266085 0.179372 -0.320768 -0.335009 -0.264589 -0.255918 -0.539559 0.194122 0.192148 0.192613 0.193952 0.198287 0.191089 0.191478 0.192029 0.195101 0.186752 0.189446 0.189177 0.174414 0.228368 0.187368 0.187566 0.189940 0.219640 0.194807 0.194636 0.196133 0.227903 0.209686 0.214764 0.209498 0.229947 0.240279 0.222317 0.222302 0.217850 0.218035 0.244583
chargesum: 0.00000
title: Mulliken charges with hydrogens summed into heavy atoms:
elementType: O O C C C C C C C C C C C C C C C C C C C
charge: -0.251421 -0.244327 0.000745 0.001875 0.003648 0.001362 0.004661 0.006070 0.044801 0.021660 0.039902 0.032739 0.076206 -0.062847 0.266085 0.179372 -0.090821 -0.094730 -0.042272 -0.033616 0.140909
polarizability: 2.36352037e+02 -1.38057576e+01 2.15545694e+02 1.91301832e+01 1.16362346e+01 1.95331526e+02
1716.lowfreq: -10.4652 -5.1138 -0.0013 -0.0006 0.0007 1.8482 6.8306 17.7795 20.1082
frequency: 6.7882 17.7344 20.0347 23.5422 36.3760 47.7643 60.3786 71.4644 87.7235 97.1489 99.5481 110.7690 130.4827 133.1247 144.8330 153.1932 157.8694 169.3841 196.5902 225.1462 241.1944 247.8326 281.9195 293.6731 309.8672 347.6423 368.7421 394.6320 447.2209 452.0076 476.1434 480.4050 518.0872 551.3312 559.6208 571.3708 708.4680 716.9450 719.2552 723.1312 725.1863 736.4674 736.9003 758.2418 777.2242 805.5390 820.7055 851.2975 874.6867 887.6286 893.5378 899.4953 936.1581 950.4695 977.6328 984.8832 985.5122 988.2466 1017.0931 1024.0635 1032.8552 1047.1405 1054.9568 1067.2377 1078.0044 1079.1183 1081.0897 1095.9687 1112.3340 1114.3951 1124.0889 1139.4763 1150.5242 1171.8972 1181.7953 1189.3046 1204.0721 1205.9277 1227.5361 1234.0736 1242.2981 1250.4452 1260.4450 1269.5577 1273.8877 1274.5095 1281.2395 1283.5128 1288.8914 1292.7539 1294.2503 1301.3197 1322.6370 1341.9019 1352.4897 1352.6009 1355.0584 1356.2281 1367.8397 1389.4282 1392.6458 1426.4781 1441.8897 1445.2964 1458.4333 1458.9000 1461.5086 1462.4539 1465.6509 1467.8360 1470.5471 1472.2068 1475.9724 1476.4600 1481.4358 1481.6628 1485.8513 1488.6915 1492.0307 1592.1026 1597.2245 2947.8234 2948.2969 2949.4802 2950.2945 2952.1860 2953.7424 2955.6935 2959.1846 2962.9383 2966.0530 2967.6096 2971.1189 2980.6596 2984.0895 2989.3364 2994.3901 2996.6372 3006.5734 3016.2547 3023.1032 3031.5568 3039.4987 3039.8558 3047.8097 3063.6005 3067.4240 3069.6863 3122.6848 3131.8769 3147.6235 3162.3584 3173.2276
redmass: 3.9483 4.3088 3.1607 1.9105 4.0160 3.8099 1.6936 3.0850 3.4067 2.8353 1.9252 2.5604 1.8733 3.0700 2.2017 2.0884 3.5789 3.7118 3.8182 1.1203 2.9942 1.5518 3.1791 2.1279 3.0716 3.5069 3.3910 3.2454 3.7152 3.1489 3.3454 3.4146 2.6863 3.9072 3.8637 6.6597 3.2648 1.0601 1.0830 3.1495 1.1788 1.2318 1.2342 1.4354 2.4822 1.3439 1.5245 1.3512 2.1413 1.9033 1.4000 1.6353 1.5549 1.2906 1.4514 6.1799 5.4730 3.3833 1.4412 2.6214 2.1438 2.0703 2.9621 2.4411 1.9997 2.2574 2.2709 2.2802 1.2638 2.0799 2.7806 1.9286 1.4679 1.0768 1.8510 1.7566 1.4747 1.5703 1.3828 1.3806 2.0947 1.5603 1.3037 1.2636 1.4694 1.0201 1.1688 1.0856 1.1534 1.1123 1.1488 1.2053 1.3417 1.4485 1.6587 1.3937 1.5844 1.6517 1.4971 1.2180 8.4948 1.6400 1.4347 1.1010 1.0743 1.0740 1.0734 1.0646 1.0810 1.0517 1.0853 1.1253 1.0708 1.0569 1.0898 1.0909 1.0946 1.0935 2.3224 6.0596 7.3888 1.0586 1.0585 1.0591 1.0591 1.0597 1.0332 1.0609 1.0610 1.0594 1.0629 1.0586 1.0367 1.0958 1.0966 1.0980 1.0609 1.1001 1.1014 1.0998 1.1010 1.1040 1.1036 1.1042 1.1025 1.1057 1.1006 1.0993 1.0988 1.0848 1.0898 1.0931 1.0989
irintensity: 0.0044 0.1278 0.1779 0.0122 0.7161 0.8624 0.2934 1.8807 0.6759 5.5941 1.2339 0.3340 0.3112 0.4517 0.5861 0.0575 0.1099 0.4742 2.2509 0.0008 0.2815 0.1386 0.6906 0.7615 1.3514 2.0454 0.8629 2.0563 1.0663 3.4011 0.1161 0.6145 2.1841 2.8458 1.1084 4.8432 10.5234 17.9904 0.4192 0.5852 7.7677 73.5790 50.4123 4.3599 0.6544 0.9010 0.5416 0.5579 3.0973 4.5241 5.5102 12.3812 13.0261 0.0138 11.9036 14.8718 26.8213 8.7052 8.1747 1.2871 3.2981 20.3262 2.0677 5.8372 0.2674 0.9801 0.1771 10.5393 0.6913 129.4772 7.8825 13.2335 15.7292 3.2161 0.7300 104.7505 24.6665 4.4647 20.1163 1.3776 111.7897 76.7892 3.1756 5.7656 11.4230 0.3666 3.7979 0.4743 0.1737 0.2502 0.1790 5.8991 2.6427 2.4303 0.8851 4.3421 0.5586 2.1930 4.2281 11.1962 2.1231 14.9340 26.9672 2.5135 0.2824 0.0928 0.9385 0.1513 1.1019 13.4108 0.5021 68.0958 6.9813 7.7685 2.8412 7.6740 4.4174 27.9199 128.6543 68.9928 7.0398 0.1682 0.6457 0.5504 1.1655 1.7458 76.2459 2.5515 1.5810 70.4227 69.4228 217.2272 36.7664 1.1793 1.8252 2.3456 49.8317 1.7292 1.9293 6.7163 1.3255 2.9455 49.5380 134.4517 191.3727 40.0606 98.2966 55.0987 23.6310 0.2644 18.3892 34.9240 9.5357
temp: 298.150 k
press: 1.00000 atm
elementType: 8 8 6 6 6 6 6 6 6 6 6 6 6 6 6 6 6 6 6 6 6 1 1 1 1 1 1 1 1 1 1 1 1 1 1 1 1 1 1 1 1 1 1 1 1 1 1 1 1 1 1 1 1
symmnumber: 1
zpe: 1228214.3 jmol-1
zpe.correction: 0.467802 hartree
zpe.thermalcorrener: 0.492990 hartree
zpe.thermalcorrenthalpy: 0.493935 hartree
zpe.thermalcorrgfe: 0.406635 hartree
zpe.sumelectzpe: -891.960964 hartree
zpe.sumelectthermal: -891.935775 hartree
zpe.sumelectthermalent: -891.934831 hartree
zpe.sumelectthermalfe: -892.022131 hartree
dipole: -0.1575 -0.2188 -0.3022
dipole: 0.4050
quadrupole: -131.6218 -122.2275 -125.8377
quadrupole: -8.3632 5.2954 -6.0967
quadrupole: -5.0595 4.3348 0.7246 -8.3632 5.2954 -6.0967
hfenergy: -892.4287657 hartree
pointgroup: C01 [X(C19H32O2)]
dipole: -0.0470826 -0.0696586 -0.1353474 debye
polarizability: 231.9573447|-17.6953754|212.2302052|20.9621117|11.9098449|203.0417068 unknown
InChI: InChI=1S/C19H32O2/c1-3-4-5-6-7-8-9-10-11-14-17-21-19-16-13-12-15-18(19)20-2/h12-13,15-16H,3-11,14,17H2,1-2H3
charge 0 multiplicity 1
53 atoms
O  3.835943 1.207073 0.972193
O  5.097613 -0.719572 2.250414
C  -3.055161 1.146636 0.057945
C  -4.030826 0.165341 -0.629945
C  -1.579856 0.924845 -0.344208
C  -5.506083 0.379749 -0.223271
C  -0.602777 1.90534 0.342455
C  -6.480293 -0.604528 -0.909327
C  0.873127 1.664802 -0.046819
C  -7.955383 -0.394799 -0.499372
C  1.837789 2.659679 0.634312
C  -8.928596 -1.381584 -1.184201
C  3.328851 2.440952 0.330146
C  -10.39953 -1.167136 -0.766309
C  4.077861 0.053063 0.218927
C  4.765306 -0.99559 0.916501
C  3.705632 -0.147745 -1.129019
C  5.061257 -2.204872 0.249284
C  4.012335 -1.362503 -1.790295
C  4.688249 -2.389006 -1.10484
C  5.801109 -1.766843 2.991218
H  -3.152697 1.04791 1.159463
H  -3.350187 2.188716 -0.187345
H  -3.93624 0.266473 -1.731594
H  -3.732306 -0.876339 -0.387856
H  -1.285076 -0.116401 -0.097043
H  -1.482211 1.021084 -1.446035
H  -5.80599 1.420883 -0.466385
H  -5.60016 0.279541 0.878463
H  -0.707237 1.81577 1.443965
H  -0.888483 2.947814 0.086727
H  -6.178122 -1.645499 -0.668279
H  -6.388457 -0.502678 -2.011181
H  0.974759 1.741528 -1.150137
H  1.159694 0.63034 0.225424
H  -8.260169 0.645212 -0.741416
H  -8.048284 -0.496218 0.602412
H  1.581117 3.696323 0.328302
H  1.704069 2.611285 1.732898
H  -8.622261 -2.420272 -0.943511
H  -8.836739 -1.278383 -2.284875
H  3.533279 2.434422 -0.757833
H  3.929785 3.245559 0.790689
H  -10.523469 -1.294621 0.325845
H  -11.073784 -1.88492 -1.269052
H  -10.739734 -0.146186 -1.024142
H  3.161443 0.629598 -1.672515
H  5.585967 -3.007897 0.775762
H  3.71252 -1.496166 -2.835074
H  4.926109 -3.331643 -1.60879
H  5.194121 -2.691141 3.06305
H  6.77985 -2.003606 2.528623
H  5.957627 -1.347191 3.995852
