program: Gaussian 09
title: 000287471
version: EM64L-G09RevD.01
frameworkgroup: C1[X(C23H34O)]
method: RPBEPBE
basis: SDD
operation: Freq
keyword: #pfreq=noraman
keyword: PBEPBE/SDD
title: #p freq=noraman PBEPBE/SDD
converged: YES YES NO NO
title: Mulliken charges:
elementType: O C C C C C C C C C C C C C C C C C C C C C C C H H H H H H H H H H H H H H H H H H H H H H H H H H H H H H H H H H
charge: -0.266810 -0.386031 -0.385636 -0.384783 -0.385135 -0.382095 -0.380787 -0.372820 -0.375102 -0.353336 -0.408548 -0.356760 -0.314199 -0.696632 0.365258 -0.591620 0.393372 -0.361973 0.387358 -0.422640 -0.413262 -0.410242 -0.242463 -0.250777 0.193616 0.193551 0.194380 0.194570 0.193345 0.193205 0.193536 0.193642 0.191887 0.191837 0.196555 0.196323 0.189497 0.189394 0.191465 0.191593 0.187498 0.187606 0.215986 0.215860 0.194748 0.194850 0.205221 0.205178 0.209609 0.215050 0.209597 0.257977 0.250648 0.232872 0.237240 0.236198 0.225402 0.225727
chargesum: 0.00000
title: Mulliken charges with hydrogens summed into heavy atoms:
elementType: O C C C C C C C C C C C C C C C C C C C C C C C
charge: -0.266810 0.001136 0.003315 0.001767 0.002043 0.001628 0.012091 0.006072 0.007956 0.021768 0.023297 0.032838 0.096199 -0.062377 0.365258 -0.333643 0.393372 -0.111325 0.387358 -0.189768 -0.176022 -0.174044 -0.017061 -0.025050
polarizability: 4.13128752e+02 -8.89847936e+00 2.30826655e+02 -1.14057488e+00 1.79017606e-01 1.55868147e+02
1716.lowfreq: -2.1517 -0.0023 0.0014 0.0015 5.2324 13.0962 13.3589 20.9477 27.4470
frequency: 13.0593 13.2926 27.2512 40.4161 47.9338 51.0421 71.7180 79.2845 84.2712 97.9518 109.0171 110.0951 123.5388 134.0676 142.3883 143.9203 149.9850 159.9715 163.1238 190.1254 207.0948 224.9117 235.6731 274.4352 296.6090 335.4426 349.2187 391.0762 404.7119 435.4267 449.6522 475.0550 493.6685 498.7468 515.3863 532.3524 555.6905 619.6395 648.5258 716.8567 722.7471 723.8005 727.5883 737.3614 755.1541 756.6364 758.0021 776.2087 783.6310 812.1119 822.5000 860.7530 864.2062 866.7462 887.0607 901.1790 909.7457 936.3299 946.9969 957.3083 967.0306 975.3583 986.5299 987.3684 989.8805 1000.8468 1014.0581 1021.3645 1031.2412 1034.8195 1047.2909 1068.0313 1072.3979 1080.4422 1082.5726 1083.7614 1100.9624 1122.6867 1125.4779 1148.7712 1163.1641 1167.6863 1172.7129 1182.1915 1200.5741 1203.3509 1224.3262 1230.6749 1240.8642 1248.6603 1255.7128 1257.4365 1270.4608 1272.3327 1279.4767 1280.0628 1284.5787 1286.7222 1292.6886 1296.5394 1301.1114 1302.5706 1303.8840 1325.8556 1343.0107 1353.3818 1354.9657 1356.3157 1357.3644 1359.5263 1378.7669 1388.5026 1412.5874 1421.3098 1440.5200 1460.8940 1461.0364 1461.7573 1463.7695 1464.0585 1466.5223 1468.6900 1471.5803 1475.6431 1476.1736 1479.9166 1483.9899 1487.6066 1490.2864 1492.3723 1515.0970 1577.6558 1605.0469 1643.7203 2944.3890 2949.7570 2949.9504 2951.4735 2951.6716 2953.9036 2954.6436 2958.2906 2962.7754 2966.7857 2969.2675 2971.9004 2982.8151 2985.3680 2989.0539 2993.8531 2994.9554 2999.9929 3002.2475 3008.8233 3018.9426 3028.8313 3037.5418 3044.0771 3063.1968 3068.4329 3070.5220 3117.4573 3123.6187 3126.4457 3141.1742 3150.1908 3160.4600 3167.9482
redmass: 4.5932 4.6822 4.6442 4.4026 2.8359 2.1195 1.6421 3.1332 4.1569 1.5866 5.2598 3.1292 1.6964 3.3293 3.8883 1.8938 2.7919 1.9880 2.1749 3.4612 3.7325 1.1357 4.4972 3.6788 5.0259 3.6549 4.1007 3.4845 3.1790 3.4406 3.8589 2.4585 3.1596 3.3885 6.0923 3.4743 5.0231 6.6203 2.7558 6.7769 1.0580 1.0648 1.0773 1.0982 1.2269 1.2042 4.8331 2.3201 1.1775 1.3733 1.2210 1.3691 1.2872 5.6584 1.9043 1.7292 1.2243 5.0147 1.3413 1.1999 1.4072 5.1374 4.9478 1.3364 4.3534 1.1401 4.2472 2.2512 3.5582 1.0603 3.3726 2.9172 2.7119 2.0431 2.2296 2.2902 2.6570 1.9233 2.8937 1.3940 1.2540 1.5161 1.1565 1.8768 1.5918 1.2659 1.4324 1.3014 2.1399 1.3327 1.3240 2.0182 1.2577 1.7328 1.0201 1.3018 1.0499 1.1502 1.0822 1.1072 1.1139 1.1113 1.3247 1.3730 1.4437 1.5917 1.6592 1.8397 1.6569 1.6206 1.5902 1.2172 4.1494 3.1596 4.1397 1.0880 1.0761 2.0693 1.0804 1.0713 1.0719 1.0815 1.0951 1.0940 1.0425 1.0969 1.0999 1.1001 1.0985 1.1106 3.4917 7.5510 5.6478 6.9777 1.0549 1.0585 1.0584 1.0590 1.0588 1.0591 1.0591 1.0594 1.0591 1.0586 1.0585 1.0366 1.0959 1.0968 1.0980 1.0997 1.0592 1.1016 1.1061 1.1037 1.1047 1.1051 1.1050 1.1046 1.1050 1.1007 1.0992 1.0858 1.0885 1.0887 1.0950 1.0917 1.1003 1.0938
irintensity: 0.0195 0.0126 0.1389 0.0084 0.1521 0.3857 0.0980 0.6821 0.0769 0.1768 0.0982 0.2849 0.8248 0.0399 0.1670 1.4110 0.4873 0.3701 0.2615 0.5999 0.5003 0.0007 0.8692 0.1545 1.6112 0.1828 0.3718 0.1616 0.1005 0.1513 0.2744 25.2089 0.2129 0.1774 0.0128 0.0939 8.8492 6.1638 0.3399 20.0807 18.8680 0.5505 7.6481 0.1019 10.5620 34.5643 1.1693 2.8296 1.0210 47.6825 4.1048 21.1262 17.8020 1.7176 4.7936 19.4314 0.4757 0.3617 0.1989 1.1095 7.9415 23.4045 25.8495 0.0571 56.7075 0.0951 20.4982 1.6851 4.7892 0.1024 2.7452 1.4713 0.1289 0.0667 0.1132 0.3881 8.9161 63.7717 2.8520 0.7794 82.3532 106.2726 14.9536 0.1996 0.0005 26.2379 0.0586 1.5435 49.0982 0.0024 5.8923 194.4874 0.0885 6.8890 0.0015 1.2224 0.5606 0.0233 0.0214 0.4313 0.0343 0.0010 0.2356 0.0650 1.0220 0.5259 0.5020 7.2240 0.4449 0.6004 26.1883 11.2787 0.7925 2.8539 2.9549 1.7914 0.5847 59.1023 1.0189 0.4169 0.3973 0.3540 0.9774 0.4213 12.2936 3.6688 1.3819 4.8092 22.1510 31.3651 75.5690 4.9737 57.7485 106.4202 33.5324 0.0249 0.0319 0.0888 0.5339 4.4473 3.5926 3.9585 4.0087 109.9313 242.1143 37.3600 0.0250 0.0947 0.3648 0.6778 38.8133 2.3558 23.9382 0.2167 0.0055 7.3509 1.5547 275.3812 105.7467 101.1793 56.2334 3.9642 0.9737 11.4795 34.7496 7.4882 42.2406 14.6814
temp: 298.150 k
press: 1.00000 atm
elementType: 8 6 6 6 6 6 6 6 6 6 6 6 6 6 6 6 6 6 6 6 6 6 6 6 1 1 1 1 1 1 1 1 1 1 1 1 1 1 1 1 1 1 1 1 1 1 1 1 1 1 1 1 1 1 1 1 1 1
symmnumber: 1
zpe: 1342664.9 jmol-1
zpe.correction: 0.511394 hartree
zpe.thermalcorrener: 0.537784 hartree
zpe.thermalcorrenthalpy: 0.538728 hartree
zpe.thermalcorrgfe: 0.450659 hartree
zpe.sumelectzpe: -970.228671 hartree
zpe.sumelectthermal: -970.202281 hartree
zpe.sumelectthermalent: -970.201337 hartree
zpe.sumelectthermalfe: -970.289406 hartree
dipole: -1.7339 1.2897 0.0054
dipole: 2.1609
quadrupole: -153.8947 -142.2556 -152.3276
quadrupole: 5.2960 -0.1533 0.0934
quadrupole: -4.4021 7.2370 -2.8349 5.2960 -0.1533 0.0934
hfenergy: -970.7400647 hartree
pointgroup: C01 [X(C23H34O1)]
dipole: 0.6816558 0.4678454 -0.1981779 debye
polarizability: 413.0644824|7.0220626|220.1843266|-6.8153601|-26.1739782|166.5747446 unknown
InChI: InChI=1S/C23H34O/c1-2-3-4-5-6-7-8-9-10-11-14-19-24-23-18-17-21-15-12-13-16-22(21)20-23/h12-13,15-18,20H,2-11,14,19H2,1H3
charge 0 multiplicity 1
58 atoms
O  -3.258734 -0.584083 0.24883
C  5.593825 0.322705 -0.19798
C  4.307912 -0.472086 0.122429
C  6.89013 -0.46314 0.102096
C  3.01119 0.313046 -0.17764
C  8.176773 0.331779 -0.215302
C  1.727291 -0.482707 0.147376
C  9.472919 -0.454739 0.08443
C  0.430104 0.301734 -0.152714
C  10.760082 0.340558 -0.230081
C  -0.845408 -0.504829 0.182539
C  12.056056 -0.447377 0.06887
C  -2.12245 0.282367 -0.118434
C  13.336987 0.356139 -0.244164
C  -4.561084 -0.088868 0.072738
C  -5.601232 -0.950838 0.443052
C  -6.964308 -0.54843 0.307091
C  -4.852169 1.215145 -0.451207
C  -7.268368 0.769102 -0.22142
C  -6.180557 1.623267 -0.590194
C  -8.053585 -1.409384 0.67876
C  -8.638696 1.17084 -0.356172
C  -9.377103 -0.98952 0.535957
C  -9.675387 0.311791 0.014071
H  5.584703 0.618724 -1.2681
H  5.59534 1.267464 0.385222
H  4.317565 -0.767581 1.192625
H  4.306985 -1.417089 -0.460228
H  6.889602 -1.407153 -0.482301
H  6.898425 -0.760785 1.171776
H  3.013514 1.259029 0.403524
H  3.000398 0.606224 -1.248499
H  8.168722 0.630051 -1.284821
H  8.177823 1.275477 0.369648
H  1.725084 -1.428705 -0.43301
H  1.738171 -0.77493 1.218103
H  9.472831 -1.397638 -0.501881
H  9.480165 -0.754598 1.153556
H  0.435429 1.249028 0.426292
H  0.418907 0.590296 -1.224816
H  10.76248 1.282932 0.357101
H  10.754344 0.641489 -1.298922
H  -0.861506 -1.447142 -0.397938
H  -0.844607 -0.786818 1.252936
H  12.059612 -0.750211 1.136074
H  12.054402 -1.387345 -0.520208
H  -2.182236 0.54204 -1.196424
H  -2.158525 1.21948 0.476274
H  13.377947 1.285172 0.355487
H  14.248391 -0.229379 -0.022699
H  13.372074 0.645482 -1.311647
H  -5.351751 -1.940483 0.839817
H  -4.04384 1.891782 -0.742439
H  -6.40151 2.620198 -0.990249
H  -7.828653 -2.405616 1.078008
H  -8.8614 2.167786 -0.756092
H  -10.198095 -1.656023 0.823367
H  -10.719276 0.626676 -0.091873
