program: Gaussian 09
title: 000287437
version: EM64L-G09RevD.01
frameworkgroup: C1[X(C15H28O2)]
method: RPBEPBE
basis: SDD
operation: Freq
keyword: #pfreq=noraman
keyword: PBEPBE/SDD
title: #p freq=noraman PBEPBE/SDD
converged: YES YES NO NO
title: Mulliken charges:
elementType: O O C C C C C C C C C C C C C C C H H H H H H H H H H H H H H H H H H H H H H H H H H H H
charge: -0.261675 -0.243166 -0.369135 -0.369422 -0.368022 -0.379475 -0.390312 -0.520318 -0.468492 0.239354 -0.351459 -0.150459 -0.302500 -0.346263 -0.182008 -0.687919 -0.733875 0.188615 0.193552 0.190856 0.190814 0.185229 0.212807 0.227179 0.205992 0.193955 0.199637 0.236597 0.246461 0.204083 0.199404 0.202906 0.226617 0.218722 0.225653 0.219407 0.192471 0.202344 0.215225 0.217832 0.210649 0.215854 0.221138 0.219942 0.221203
chargesum: 0.00000
title: Mulliken charges with hydrogens summed into heavy atoms:
elementType: O O C C C C C C C C C C C C C C C
charge: -0.261675 -0.243166 0.013031 0.012248 0.030015 0.053696 0.003281 -0.037260 -0.065004 0.239354 0.078064 0.068263 0.142560 0.048553 0.033846 -0.044214 -0.071592
polarizability: 2.11569659e+02 -4.95377043e+00 1.59182277e+02 2.63917685e+00 -8.62700425e+00 1.45757752e+02
1716.lowfreq: -24.5653 -0.0008 0.0003 0.0015 2.1429 4.9566 11.6055 13.3199 27.3996
frequency: -18.4652 13.0350 27.2861 34.3128 46.8456 53.1267 56.8579 69.8281 81.5740 99.2563 103.5404 122.4485 137.1476 142.6183 174.5500 186.4934 196.9879 209.8496 228.7418 241.3571 277.3533 304.0793 318.1945 387.9926 406.9424 411.3509 475.4042 486.2626 515.7114 572.5046 664.2906 719.9942 730.2276 743.7351 753.2794 778.2585 796.4381 832.0103 845.4543 864.3820 898.3298 911.6583 928.5295 945.6920 951.1333 976.8957 983.5193 1010.1160 1023.7894 1034.4774 1043.7181 1047.6808 1075.7784 1077.2099 1081.7292 1090.5905 1096.5578 1100.2314 1114.9204 1142.9060 1161.3342 1165.2343 1186.0658 1214.8228 1226.5064 1230.5676 1258.2275 1268.1659 1270.7269 1282.1230 1284.0332 1289.2307 1290.7376 1291.4840 1293.3958 1295.8393 1317.4464 1332.3966 1344.1999 1348.1626 1358.6943 1360.9801 1371.4041 1389.6219 1392.2901 1441.9249 1453.4005 1458.6318 1461.1992 1462.2483 1463.4971 1466.7445 1470.4063 1472.8913 1477.1922 1478.0255 1478.1271 1486.6930 1488.3165 1640.2589 1690.2892 2950.3129 2951.3206 2954.1230 2959.6054 2962.4290 2966.1679 2968.1521 2975.7056 2976.2608 2986.0592 2989.3645 2991.0531 2999.7458 3012.0159 3013.5589 3019.5645 3020.1344 3035.9326 3036.8036 3043.8040 3050.9727 3062.1197 3066.0675 3067.2069 3073.7586 3075.5443 3088.0210 3099.2784
redmass: 2.9992 3.7738 3.4276 4.6004 2.6740 2.1896 2.1909 3.1580 2.1864 1.9074 2.2599 1.9991 2.2378 3.2457 3.9243 1.7635 1.5679 3.5193 1.3368 2.2088 2.6042 3.8944 2.5721 3.2227 2.8621 3.4841 2.4943 3.3092 3.3590 3.0970 4.0658 1.0748 1.1568 1.0735 1.3381 1.3365 1.3225 3.0273 1.7444 1.7505 1.8301 1.5397 2.5992 1.5492 1.8012 1.1019 1.9054 2.4287 2.3937 3.5509 1.5290 2.4223 2.8949 2.4477 2.1307 2.4721 1.9118 2.6949 2.3161 2.4412 1.8448 1.7584 1.3385 1.4388 1.3181 1.3194 1.2959 1.2715 1.2618 1.1398 1.1379 1.1353 1.0956 1.1675 1.2456 1.1234 1.3803 1.4077 1.4149 1.5151 1.6629 1.5740 1.4455 1.2154 1.2392 1.0860 1.0934 1.0924 1.0774 1.0501 1.0640 1.0846 1.0669 1.0574 1.0635 1.0449 1.0957 1.0998 1.0844 9.1047 6.2002 1.0587 1.0599 1.0600 1.0612 1.0368 1.0602 1.0587 1.0363 1.0655 1.0901 1.0671 1.0597 1.0977 1.1006 1.0999 1.0576 1.1001 1.0973 1.1015 1.0997 1.1031 1.0928 1.0994 1.0929 1.1011 1.0995 1.0938 1.1083
irintensity: 0.3373 0.0084 0.4599 0.4480 0.1487 0.0930 0.6727 0.9954 0.5864 0.3538 0.3652 0.0640 0.1612 0.1914 0.2850 0.3664 3.0199 2.8698 0.3110 1.5505 9.6241 10.7209 4.9417 1.1729 5.0299 1.9388 0.1885 0.9123 2.6671 2.8173 5.5070 14.4901 0.1403 9.9486 0.7330 4.8402 0.5249 6.0534 1.2365 1.1492 12.1573 5.8108 30.5363 10.2375 6.5326 65.7178 9.4716 8.0382 17.5694 28.8568 0.3568 4.4415 20.0950 11.2865 1.3965 1.7577 121.7088 11.1326 17.3300 176.1143 0.7008 7.4983 17.1305 13.5082 0.4014 37.2809 5.0227 8.3392 9.1642 4.2620 1.5222 1.2281 0.7751 0.1869 1.6645 4.5402 27.5425 1.8741 2.1127 20.3156 1.4001 6.0728 3.4737 9.5633 10.9172 19.9221 8.9560 15.5109 1.0663 11.9558 0.9329 4.3011 0.3291 14.3199 5.2231 11.2931 1.4808 21.6899 18.7577 144.2485 0.5326 1.6474 21.5578 10.8806 23.3207 54.1849 99.7881 32.0161 31.1861 2.4646 5.4682 38.3544 23.5907 12.6417 15.1088 8.3161 49.6722 14.0322 31.2507 49.2291 75.7968 7.6297 19.2504 58.3029 15.3762 62.8190 52.5068 72.5511 38.0768
temp: 298.150 k
press: 1.00000 atm
elementType: 8 8 6 6 6 6 6 6 6 6 6 6 6 6 6 6 6 1 1 1 1 1 1 1 1 1 1 1 1 1 1 1 1 1 1 1 1 1 1 1 1 1 1 1 1
symmnumber: 1
zpe: 1047652.4 jmol-1
zpe.correction: 0.399030 hartree
zpe.thermalcorrener: 0.420384 hartree
zpe.thermalcorrenthalpy: 0.421328 hartree
zpe.thermalcorrgfe: 0.344601 hartree
zpe.sumelectzpe: -737.440755 hartree
zpe.sumelectthermal: -737.419401 hartree
zpe.sumelectthermalent: -737.418457 hartree
zpe.sumelectthermalfe: -737.495183 hartree
dipole: 0.3765 0.6353 -1.3673
dipole: 1.5540
quadrupole: -96.6410 -104.7245 -109.5660
quadrupole: 0.6993 -3.6687 1.9934
quadrupole: 7.0029 -1.0807 -5.9222 0.6993 -3.6687 1.9934
hfenergy: -737.8397845 hartree
pointgroup: C01 [X(C15H28O2)]
dipole: 0.14432 0.3293656 -0.4944676 debye
polarizability: 211.4636419|-6.0489436|161.6712356|0.6391392|-6.0459819|143.3748111 unknown
InChI: InChI=1S/C15H28O2/c1-3-5-7-8-9-10-11-12-13-15(16)17-14-6-4-2/h3,5H,4,6-14H2,1-2H3
charge 0 multiplicity 1
45 atoms
O  3.873401 -0.280116 -1.279245
O  3.157183 -0.950861 0.839343
C  -2.177071 -1.118117 0.134287
C  -1.018222 -0.360623 -0.552188
C  -3.574155 -0.612883 -0.28961
C  0.372959 -0.859546 -0.105031
C  -4.726846 -1.405131 0.36552
C  1.520751 -0.121413 -0.825666
C  -6.139285 -0.877651 -0.013515
C  2.895049 -0.504099 -0.301709
C  5.913519 0.674824 -0.195551
C  -6.440446 0.495137 0.555161
C  5.288814 -0.548799 -0.879194
C  7.404207 0.438589 0.145469
C  -6.781315 1.593789 -0.168512
C  8.050045 1.661977 0.831155
C  -7.090382 2.957956 0.408979
H  -2.09163 -2.201314 -0.094621
H  -2.072989 -1.025413 1.235658
H  -1.109614 0.724121 -0.332827
H  -1.116364 -0.464697 -1.653326
H  -3.670028 -0.679263 -1.394185
H  -3.675868 0.460884 -0.033423
H  0.489934 -0.730285 0.987494
H  0.457533 -1.947406 -0.298113
H  -4.612574 -1.375245 1.469445
H  -4.649371 -2.472338 0.072691
H  1.407925 0.973593 -0.682242
H  1.495229 -0.291222 -1.917006
H  -6.893462 -1.600032 0.364373
H  -6.243539 -0.856715 -1.1168
H  5.817948 1.554197 -0.861978
H  5.352591 0.898709 0.731589
H  -6.371346 0.584226 1.652456
H  5.306143 -1.427901 -0.20947
H  5.791188 -0.784207 -1.832354
H  7.962623 0.195864 -0.781741
H  7.49433 -0.445934 0.807956
H  7.530332 1.904324 1.776798
H  9.113673 1.476028 1.067152
H  7.998152 2.555066 0.180483
H  -6.844946 1.501997 -1.264653
H  -8.117087 3.281812 0.147724
H  -6.402604 3.72902 0.009151
H  -7.002285 2.958497 1.510075
