program: Gaussian 09
title: 000287425
version: EM64L-G09RevD.01
frameworkgroup: C1[X(C10H18O2)]
method: RPBEPBE
basis: SDD
operation: Freq
keyword: #pfreq=noraman
keyword: PBEPBE/SDD
title: #p freq=noraman PBEPBE/SDD
converged: YES YES NO NO
title: Mulliken charges:
elementType: O O C C C C C C C C C C H H H H H H H H H H H H H H H H H H
charge: -0.280756 -0.279394 0.290721 -0.439736 -0.416009 -0.380352 -0.393298 -0.420790 -0.402335 -0.363827 -0.336116 -0.325056 0.233757 0.211495 0.201348 0.225721 0.209126 0.198841 0.216160 0.192716 0.198492 0.196878 0.207193 0.202595 0.192512 0.191431 0.205962 0.231234 0.226268 0.205221
chargesum: 0.00000
title: Mulliken charges with hydrogens summed into heavy atoms:
elementType: O O C C C C C C C C C C
charge: -0.280756 -0.279394 0.290721 0.005516 0.011060 0.027615 0.015578 -0.025421 0.007453 0.020115 0.101080 0.106432
polarizability: 1.28797298e+02 -2.26940769e+00 1.04634466e+02 1.18454191e+00 -2.41383354e-01 9.15499362e+01
1716.lowfreq: -16.2152 -0.0012 -0.0010 -0.0007 14.4478 23.3533 40.2104 59.4644 123.1224
frequency: 38.9444 58.9998 123.1084 169.6169 199.8383 210.7362 244.8920 249.1334 297.3817 355.9039 386.4283 404.9989 445.7612 481.7720 524.0457 627.1540 691.2597 704.1030 738.6474 755.5294 770.3425 824.2415 831.9041 844.8760 872.5378 886.8993 919.4342 939.6642 972.6565 976.5627 999.0330 1003.1958 1022.5864 1068.5936 1105.2203 1113.6396 1115.2123 1126.0154 1136.8204 1154.1928 1167.1678 1184.2939 1211.1929 1236.6952 1241.1961 1260.1907 1282.0590 1301.0643 1310.6722 1315.7284 1326.8154 1339.6079 1345.6087 1351.6786 1353.3583 1367.2173 1371.2235 1451.5987 1455.0562 1462.0163 1462.8461 1477.2369 1483.0716 1487.1509 1492.7984 1496.8473 2951.8404 2965.6945 2967.9877 2976.6452 2979.8422 2982.2489 2990.9251 2995.3136 3007.5547 3013.8850 3019.0949 3022.9220 3035.7084 3039.1161 3050.6182 3061.6310 3072.5512 3087.0883
redmass: 1.9402 3.1453 2.9761 3.0502 3.0098 2.6442 2.6219 2.5945 2.2332 2.2292 2.6410 3.0649 2.0943 1.9175 2.5647 2.7526 5.6564 3.3381 2.8732 2.3961 1.6298 1.9386 1.4114 1.8592 2.0389 2.2587 3.4541 1.9192 5.7348 4.1280 2.0190 2.4985 2.2937 2.2328 1.6434 2.1314 2.1185 2.1125 1.3403 1.5082 1.1298 1.1264 1.2463 1.2514 1.4649 1.2194 1.2111 1.2584 1.2656 1.3644 1.4241 1.4172 1.4199 1.4923 1.4781 1.4351 1.3943 1.0808 1.0928 1.0884 1.0838 1.0811 1.0833 1.0786 1.0843 1.0827 1.0604 1.0626 1.0627 1.0652 1.0649 1.0643 1.0648 1.0643 1.0889 1.0735 1.0991 1.0970 1.0964 1.0994 1.0972 1.0998 1.1006 1.1024
irintensity: 1.5199 0.5250 5.0870 1.8034 3.9628 1.5015 0.6804 0.2009 5.4865 1.2558 6.5853 2.8904 3.7905 1.8979 4.6518 1.1696 0.3817 2.2924 17.1595 7.9002 18.3940 13.5081 5.8792 2.1900 4.2769 7.8263 55.0525 22.1279 12.7822 22.9793 12.1737 35.0016 8.0451 70.5897 2.4689 15.0417 4.8818 10.5746 4.4359 6.9970 1.1190 1.4376 3.7963 7.7407 11.9470 3.7501 4.6655 3.0323 1.3284 1.8737 1.1121 1.6106 1.0752 6.4079 5.2985 4.5647 8.0039 11.2307 1.7396 10.8665 8.3355 9.3407 8.0643 3.6133 21.9526 13.8795 35.2335 28.4624 14.9844 37.2859 9.2484 45.8911 17.7731 137.3819 73.0020 4.6616 8.4812 63.8688 64.1013 60.8993 72.1274 9.7463 19.2097 58.7243
temp: 298.150 k
press: 1.00000 atm
elementType: 8 8 6 6 6 6 6 6 6 6 6 6 1 1 1 1 1 1 1 1 1 1 1 1 1 1 1 1 1 1
symmnumber: 1
zpe: 698899.9 jmol-1
zpe.correction: 0.266197 hartree
zpe.thermalcorrener: 0.277886 hartree
zpe.thermalcorrenthalpy: 0.278830 hartree
zpe.thermalcorrgfe: 0.228506 hartree
zpe.sumelectzpe: -541.302567 hartree
zpe.sumelectthermal: -541.290878 hartree
zpe.sumelectthermalent: -541.289934 hartree
zpe.sumelectthermalfe: -541.340257 hartree
dipole: -0.6105 1.1795 -0.7675
dipole: 1.5339
quadrupole: -64.5906 -75.2226 -76.8807
quadrupole: -3.0480 1.2196 -2.9120
quadrupole: 7.6407 -2.9913 -4.6494 -3.0480 1.2196 -2.9120
hfenergy: -541.5687634 hartree
pointgroup: C01 [X(C10H18O2)]
dipole: 0.2271952 -0.4546262 -0.3254269 debye
polarizability: 128.636452|-3.0229688|104.7452753|-1.0161815|0.9805723|91.5999726 unknown
InChI: InChI=1S/C10H18O2/c1-2-4-6-10(7-5-3-1)11-8-9-12-10/h1-9H2
charge 0 multiplicity 1
30 atoms
O  1.547922 -0.4630 1.162497
O  1.754678 1.106765 -0.56054
C  0.74851 0.261557 0.146491
C  -0.191854 1.208597 0.904744
C  0.1228 -0.711641 -0.874328
C  -1.319558 1.870353 0.064237
C  -0.805946 -1.807338 -0.303495
C  -2.722129 1.21502 0.170741
C  -2.118164 -1.333299 0.38015
C  -2.907061 -0.225563 -0.377905
C  2.857009 -0.742832 0.541088
C  3.028694 0.357892 -0.555741
H  0.467102 1.985173 1.331866
H  -0.621182 0.656298 1.758957
H  0.949708 -1.207703 -1.42124
H  -0.412805 -0.106839 -1.628819
H  -1.006656 1.9405 -0.996104
H  -1.427071 2.917901 0.40758
H  -0.231177 -2.42391 0.415007
H  -1.076048 -2.472912 -1.148859
H  -3.443546 1.876282 -0.352803
H  -3.024379 1.216135 1.239498
H  -1.904728 -0.985602 1.4084
H  -2.763274 -2.226345 0.497586
H  -3.989759 -0.455254 -0.318828
H  -2.655423 -0.252739 -1.458087
H  2.870977 -1.759412 0.101114
H  3.608169 -0.681724 1.34489
H  3.8242 1.083515 -0.317627
H  3.224387 -0.086777 -1.550866
