program: Gaussian 09
title: 000287426
version: EM64L-G09RevD.01
frameworkgroup: C1[X(C10H16Br2O2)]
method: RPBEPBE
basis: SDD
operation: Freq
keyword: #p
keyword: freq=noraman
keyword: PBEPBE/SDD
title: #p freq=noraman PBEPBE/SDD
converged: NO YES NO NO
title: Mulliken charges:
elementType: Br Br O O C C C C C C C C C C H H H H H H H H H H H H H H H H
charge: -0.012996 -0.037976 -0.244846 -0.270085 0.400317 -0.555357 -0.536611 -0.344827 -0.397646 -0.374735 -0.350691 -0.422598 -0.312872 -0.315108 0.304778 0.327005 0.236548 0.226644 0.219291 0.253769 0.236001 0.195205 0.197753 0.245714 0.195178 0.204935 0.244044 0.233193 0.214690 0.241284
chargesum: 0.00000
title: Mulliken charges with hydrogens summed into heavy atoms:
elementType: Br Br O O C C C C C C C C C C
charge: -0.012996 -0.037976 -0.244846 -0.270085 0.400317 -0.250579 -0.209605 0.118365 0.075414 0.056471 0.092776 -0.022486 0.164365 0.140866
polarizability: 1.57545632e+02 -2.44651668e+00 1.41713086e+02 8.69467775e+00 3.21637412e+00 1.27327382e+02
1716.lowfreq: -10.7853 -4.1529 -0.0005 -0.0003 0.0005 7.3669 57.9058 61.6249 97.9443
frequency: 57.9017 61.6175 97.9034 117.9177 136.1212 141.9272 170.9450 192.8434 212.6517 224.8102 267.6942 273.5144 308.3574 328.7149 354.4922 425.9478 431.1032 447.6090 500.4188 625.2067 635.1547 646.7981 669.7629 714.8313 761.7970 803.3643 833.7843 859.2988 864.0037 879.7408 902.8116 929.8764 948.5358 974.3351 1000.0466 1011.7041 1021.9886 1051.9430 1063.4993 1105.4202 1111.3268 1116.7804 1125.4748 1144.0578 1164.4846 1172.5936 1193.3121 1199.9500 1226.1146 1242.7459 1260.7679 1277.4543 1301.6474 1323.1115 1330.1667 1332.7037 1339.1319 1345.4407 1352.2006 1357.1450 1367.0582 1451.9107 1456.3084 1461.9663 1470.7163 1473.6757 1486.1388 1493.6141 2953.1754 2984.6571 2988.1576 2994.0651 2996.1759 3005.6140 3016.5849 3021.2042 3046.3969 3050.6120 3064.5437 3068.7595 3074.3985 3084.1030 3094.7379 3107.5338
redmass: 9.1415 4.6886 3.4348 8.2381 4.7283 5.1640 3.4016 3.1841 3.9981 2.5961 2.8138 4.3075 5.1214 2.4784 2.4300 4.1947 4.1039 2.3730 2.2630 2.8921 2.5386 4.0205 5.2423 6.3917 2.8828 1.8376 1.6771 2.1235 2.3236 2.7923 3.6737 2.3536 2.6535 3.5234 2.9028 2.7682 2.5749 3.0185 2.0256 1.5027 1.4618 2.3465 1.8837 1.9864 1.1620 1.3824 1.2156 1.2694 1.2310 1.2359 1.2390 1.2856 1.3627 1.2901 1.2613 1.2495 1.2774 1.3514 1.4158 1.3704 1.4108 1.0750 1.0832 1.0875 1.0809 1.0856 1.0903 1.0769 1.0621 1.0645 1.0672 1.0660 1.0693 1.0662 1.0912 1.0599 1.0949 1.0928 1.0972 1.0954 1.0931 1.0858 1.1019 1.1063
irintensity: 1.1547 0.4181 5.6517 0.7807 0.6481 0.9212 1.3349 0.4777 1.6571 1.8198 3.5696 2.5870 0.5055 2.4711 7.1702 16.4961 11.4594 0.0179 6.6443 44.0790 5.4058 11.1720 31.2805 22.3627 5.0143 17.8548 8.1079 2.8642 22.0155 26.9587 22.9288 46.3903 15.2601 9.2120 30.7579 5.7051 9.5899 77.8484 31.7871 3.1535 3.6718 5.2036 25.2814 9.2234 0.7478 10.7144 5.7001 4.9822 5.3484 9.2571 1.9009 3.6753 1.7847 2.8084 2.5335 1.8067 1.2468 0.4465 0.7693 5.9287 3.3560 21.9355 6.3102 6.6953 12.9955 2.7070 7.9139 26.4925 37.8274 15.6246 24.9640 62.3603 19.4184 40.4453 69.1518 45.7081 31.8923 1.3009 9.2520 13.3339 39.7148 1.0751 13.9386 25.3334
temp: 298.150 k
press: 1.00000 atm
elementType: 35 35 8 8 6 6 6 6 6 6 6 6 6 6 1 1 1 1 1 1 1 1 1 1 1 1 1 1 1 1
symmnumber: 1
zpe: 647090.7 jmol-1
zpe.correction: 0.246464 hartree
zpe.thermalcorrener: 0.260852 hartree
zpe.thermalcorrenthalpy: 0.261796 hartree
zpe.thermalcorrgfe: 0.204179 hartree
zpe.sumelectzpe: -566.880555 hartree
zpe.sumelectthermal: -566.866166 hartree
zpe.sumelectthermalent: -566.865222 hartree
zpe.sumelectthermalfe: -566.922839 hartree
dipole: -0.1727 1.6760 3.1015
dipole: 3.5296
quadrupole: -110.8472 -102.0060 -93.6720
quadrupole: -5.1734 1.5063 -7.2487
quadrupole: -8.6722 0.1691 8.5031 -5.1734 1.5063 -7.2487
hfenergy: -567.1270187 hartree
pointgroup: C01 [X(C10H16Br2O2)]
dipole: -0.3528723 -0.2689887 1.3158672 debye
polarizability: 142.4073804|8.812783|149.6565439|-2.3842113|13.4068055|134.5221758 unknown
InChI: InChI=1S/C10H16Br2O2/c11-8-4-2-1-3-5-9(12)10(8)13-6-7-14-10/h8-9H,1-7H2
charge 0 multiplicity 1
30 atoms
Br 0.435311 -2.428914 -2.042011
Br 1.169276 2.680559 -0.793488
O  2.126926 -0.390912 -0.385325
O  0.569904 0.303973 1.255692
C  0.686664 -0.1541 -0.145345
C  -0.005959 -1.553313 -0.226409
C  0.168751 0.914173 -1.133711
C  -1.525966 -1.734688 -0.009806
C  -1.337822 1.216131 -1.185468
C  -2.190435 -0.938486 1.156319
C  -2.048109 1.515122 0.167106
C  -2.920037 0.359072 0.721093
C  2.884564 0.068797 0.803815
C  1.850764 -0.014637 1.937857
H  0.56403 -2.189691 0.471576
H  0.547272 0.634822 -2.130608
H  -1.663139 -2.818941 0.162409
H  -2.067861 -1.518695 -0.946771
H  -1.828495 0.363592 -1.696906
H  -1.456691 2.073284 -1.872194
H  -1.447466 -0.703697 1.937848
H  -2.945324 -1.603941 1.619354
H  -2.709593 2.390896 0.024119
H  -1.297759 1.812585 0.920736
H  -3.686458 0.093648 -0.038153
H  -3.476794 0.744601 1.599187
H  3.237059 1.102151 0.641669
H  3.735384 -0.620051 0.927731
H  1.80094 -1.025359 2.386885
H  1.982463 0.745715 2.722995
