program: Gaussian 09
title: 000287401
version: EM64L-G09RevD.01
frameworkgroup: C1[X(C14H10ClN3O)]
method: RPBEPBE
basis: SDD
operation: Freq
keyword: #p
keyword: freq=noraman
keyword: PBEPBE/SDD
title: #p freq=noraman PBEPBE/SDD
converged: YES YES NO NO
title: Mulliken charges:
elementType: Cl O N N N C C C C C C C C C C C C C C H H H H H H H H H H
charge: -0.053217 -0.217984 -0.417923 -0.041460 -0.037993 0.287261 0.309111 0.004155 -0.275510 -0.568013 0.043895 -0.397235 0.107718 -0.152301 -0.211810 -0.277299 -0.197417 -0.372961 -0.165820 0.328311 0.280468 0.267555 0.241775 0.243977 0.261707 0.286999 0.242709 0.246599 0.234703
chargesum: 0.00000
title: Mulliken charges with hydrogens summed into heavy atoms:
elementType: Cl O N N N C C C C C C C C C C C C C C
charge: -0.053217 -0.217984 -0.089612 -0.041460 -0.037993 0.287261 0.309111 0.004155 0.004958 -0.058683 0.043895 -0.153258 0.107718 -0.152301 0.049897 0.009700 0.045292 -0.126362 0.068884
polarizability: 2.24044234e+02 -4.06923416e+00 2.45442766e+02 1.43961323e+01 1.00226882e+01 1.03732623e+02
1716.lowfreq: -5.9064 -0.6071 0.0012 0.0016 0.0016 6.1146 32.5011 54.5770 68.4402
frequency: 32.4867 54.5503 68.4378 71.4930 118.4115 150.0422 169.7003 206.5376 250.9787 271.4632 307.5005 317.2793 327.8000 380.6632 397.2663 410.8563 439.2084 450.7380 488.5089 508.2695 535.8689 555.9294 600.0061 618.3601 652.5594 664.4237 689.3647 712.7146 733.5618 749.3325 763.1998 806.0952 815.3561 839.6135 869.7761 892.6506 913.9985 936.9108 947.0932 961.9092 969.5232 987.3562 1012.2303 1013.5134 1038.9401 1086.0481 1091.6756 1126.4821 1158.0123 1167.1618 1194.2881 1227.9046 1263.7150 1279.0366 1291.1381 1300.8891 1321.1738 1326.1763 1361.7056 1384.8110 1410.2148 1438.4440 1446.5898 1463.6450 1470.5963 1546.7428 1557.5324 1573.3943 1583.1501 1600.7448 1648.6531 2938.1263 3109.4969 3130.9953 3137.1147 3145.3180 3168.2208 3174.9417 3182.9567 3196.9833 3505.7741
redmass: 4.7155 6.8669 10.0840 5.3952 6.7333 5.1585 6.9481 6.0832 4.8363 5.9872 10.0960 5.6106 7.0874 5.1558 3.4737 3.9225 4.6179 6.0816 3.6011 3.8003 3.5934 5.3554 2.9009 5.3455 3.9617 4.3448 4.2518 3.0735 4.3463 1.7450 5.2278 2.1924 1.7013 4.4842 1.5295 4.2349 1.3146 4.5481 1.3547 6.3924 1.4848 4.2600 2.7152 1.3615 2.2105 1.7826 1.9595 1.9387 1.2230 1.5173 1.5453 2.1072 1.5973 1.7544 2.5483 2.8654 2.5844 2.4116 2.8663 5.7707 1.9590 2.2071 2.2124 1.1050 2.7380 7.2851 6.0779 6.3682 7.3877 6.9321 6.0024 1.0682 1.0934 1.0884 1.0899 1.0904 1.0972 1.0961 1.0977 1.0926 1.0757
irintensity: 2.8135 0.9260 1.9607 1.6679 2.1350 2.5673 2.8038 1.6855 4.0209 2.5012 3.2642 2.0596 0.8072 4.5048 5.1547 3.3953 3.6548 2.6189 10.3548 5.3762 20.9338 14.7807 33.3209 8.9818 22.4962 3.4340 13.3603 38.9060 8.7506 37.4204 24.1939 55.1132 39.5558 23.9267 9.7570 4.4537 0.2904 26.2904 0.8034 6.2299 2.6975 1.1487 22.0669 1.7585 4.3925 16.6766 15.8910 14.5367 1.3305 1.7773 36.5721 27.3876 4.3231 6.7026 41.2764 86.4250 4.6674 27.0600 17.2619 6.4568 17.6846 18.7853 39.5022 12.3179 97.3429 49.5359 6.6744 2.1343 21.6742 2.9802 550.3047 31.9456 15.0268 10.7048 7.1002 12.9019 24.0838 3.0421 10.9420 0.1356 29.9413
temp: 298.150 k
press: 1.00000 atm
elementType: 17 8 7 7 7 6 6 6 6 6 6 6 6 6 6 6 6 6 6 1 1 1 1 1 1 1 1 1 1
symmnumber: 1
zpe: 554542.9 jmol-1
zpe.correction: 0.211214 hartree
zpe.thermalcorrener: 0.226350 hartree
zpe.thermalcorrenthalpy: 0.227294 hartree
zpe.thermalcorrgfe: 0.167705 hartree
zpe.sumelectzpe: -1237.715773 hartree
zpe.sumelectthermal: -1237.700638 hartree
zpe.sumelectthermalent: -1237.699694 hartree
zpe.sumelectthermalfe: -1237.759283 hartree
dipole: 0.5082 -2.2528 0.0626
dipole: 2.3102
quadrupole: -91.5166 -138.4585 -113.5730
quadrupole: -10.2318 5.1305 4.5369
quadrupole: 22.9995 -23.9425 0.9430 -10.2318 5.1305 4.5369
hfenergy: -1237.9269876 hartree
pointgroup: C01 [X(C14H10Cl1N3O1)]
dipole: 0.5358252 -0.7335919 0.0291984 debye
polarizability: 230.4907829|-10.4161726|239.3886664|8.6287774|13.5815929|103.3401732 unknown
InChI: InChI=1S/C14H10ClN3O/c15-9-4-5-11-10(7-9)14(17-8-13(19)18-11)12-3-1-2-6-16-12/h1-7,18H,8H2
charge 0 multiplicity 1
29 atoms
Cl -0.986934 -4.473393 0.673292
O  -2.622057 3.530508 -0.395139
N  -2.32457 1.256282 -0.759029
N  0.111204 1.871275 0.881407
N  2.069265 -0.759621 -0.638311
C  -0.690919 -0.389206 0.189448
C  -1.960386 -0.069232 -0.391141
C  0.350411 0.657093 0.423752
C  -0.417148 -1.748858 0.507265
C  -1.269674 2.251018 1.238619
C  1.792702 0.353721 0.112438
C  -2.888162 -1.106567 -0.681903
C  -2.125498 2.435512 -0.023827
C  -1.363994 -2.743958 0.237315
C  -2.599089 -2.447274 -0.376151
C  2.813273 1.232882 0.566433
C  4.152488 0.956095 0.228595
C  3.370078 -1.014519 -0.955248
C  4.443684 -0.189366 -0.550477
H  -2.965902 1.363822 -1.551741
H  0.545699 -2.014174 0.945539
H  -1.250014 3.214886 1.766709
H  -1.759789 1.486255 1.881678
H  -3.853636 -0.851772 -1.133532
H  -3.319903 -3.239866 -0.595152
H  2.52523 2.10682 1.155623
H  4.956048 1.619088 0.56601
H  3.546336 -1.912918 -1.557785
H  5.470157 -0.439532 -0.836188
