program: Gaussian 09
title: 000287391
version: EM64L-G09RevD.01
frameworkgroup: C1[X(C18H14O4)]
method: RPBEPBE
basis: SDD
operation: Freq
keyword: #pfreq=noraman
keyword: PBEPBE/SDD
title: #p freq=noraman PBEPBE/SDD
converged: YES YES NO NO
title: Mulliken charges:
elementType: O O O O C C C C C C C C C C C C C C C C C C H H H H H H H H H H H H H H
charge: -0.392644 -0.392694 -0.190226 -0.190442 0.305936 0.306058 0.439346 0.439237 -0.395511 -0.395298 -0.333107 -0.333262 -0.396875 -0.396884 -0.246539 -0.246542 -0.244844 -0.244837 -0.082897 -0.082388 -0.238578 -0.238565 0.229381 0.229344 0.241294 0.241420 0.233355 0.233342 0.227728 0.227721 0.230454 0.230457 0.232389 0.232386 0.381144 0.381145
chargesum: 0.00000
title: Mulliken charges with hydrogens summed into heavy atoms:
elementType: O O O O C C C C C C C C C C C C C C C C C C
charge: -0.011500 -0.011549 -0.190226 -0.190442 0.305936 0.306058 0.439346 0.439237 -0.166130 -0.165954 -0.091813 -0.091843 -0.163520 -0.163542 -0.018811 -0.018822 -0.014391 -0.014381 -0.082897 -0.082388 -0.006190 -0.006179
polarizability: 4.85741106e+02 2.21750382e+01 1.95983044e+02 -2.67935138e-02 -8.91036254e-03 1.17001821e+02
1716.lowfreq: -8.8020 -2.2557 0.0006 0.0009 0.0010 2.5830 13.7779 15.9962 19.5259
frequency: 13.5279 15.9515 19.4329 45.5376 48.0147 50.3898 54.6642 99.0306 112.3867 142.4491 150.2438 181.9927 219.6224 220.5798 256.1865 273.3939 315.5327 322.6258 402.1239 402.5539 432.6327 478.6973 508.3014 518.4998 527.1565 587.6422 589.4394 599.9318 614.3289 615.2161 626.0117 650.6160 685.7132 687.3816 694.6149 694.7850 739.4470 759.5175 769.2674 784.2716 788.3854 842.5183 843.7255 865.9917 871.3321 890.8911 906.8736 926.7277 931.0618 975.5146 975.5711 987.9916 988.1933 996.3849 996.4911 1025.5622 1027.6105 1031.8900 1053.2460 1090.4831 1093.0419 1174.2472 1174.6650 1194.6936 1199.3255 1199.6518 1219.9981 1253.1101 1258.5762 1282.8566 1319.4131 1333.2876 1364.4550 1380.0654 1396.2614 1408.6787 1440.8292 1441.6742 1483.3895 1486.7672 1570.3298 1579.1101 1587.8925 1607.7801 1613.2516 1615.7370 1646.1578 1648.3440 3096.3200 3096.9443 3121.1385 3121.1619 3131.5936 3131.6378 3145.1762 3145.1895 3161.9963 3162.1088 3175.6471 3175.8704 3482.5308 3482.6214
redmass: 5.2006 4.8830 5.8596 6.0490 7.0106 7.6245 6.2245 5.0052 6.4238 6.7360 5.7725 6.0830 5.0223 6.8079 7.9031 5.1500 3.6617 4.4176 2.8028 2.7955 5.0050 3.3589 2.9404 4.5054 3.4274 2.4654 2.2766 5.3081 5.8216 6.3471 2.8799 1.8307 2.7780 3.6400 1.8745 1.8096 4.6879 1.8620 2.1031 4.9610 5.5178 1.2785 1.2674 3.3585 1.6182 1.4971 4.9788 1.5279 1.6839 1.4475 1.4486 5.0802 5.0941 1.3393 1.3369 3.0694 2.3074 2.4162 2.3868 1.6520 1.6439 1.0742 1.0618 1.7821 1.1190 1.1838 2.8451 2.1011 1.7876 3.0709 1.6041 1.4572 1.8854 5.7279 2.8480 2.1293 2.2327 2.2249 2.1707 2.2816 6.3750 5.7301 5.7541 5.9997 6.0568 6.6782 9.5500 9.5742 1.0879 1.0878 1.0871 1.0871 1.0872 1.0872 1.0931 1.0931 1.0975 1.0975 1.0969 1.0969 1.0637 1.0637
irintensity: 0.8012 0.1598 0.0262 0.6181 0.6365 0.0130 0.2613 0.1164 0.0246 0.0125 0.0005 0.0937 0.3517 0.0476 2.7144 4.2015 0.8016 0.1111 1.0068 0.0803 2.7767 26.5850 0.4743 53.9510 0.8990 111.2435 2.1017 0.0523 0.0016 0.8705 5.5619 110.5526 27.2983 11.8100 51.8654 16.4473 8.6542 67.7671 24.9162 13.1137 5.9452 0.0004 0.0857 8.8685 5.6394 2.1027 12.5177 4.7120 10.0869 0.5121 1.5352 6.0160 1.6446 0.1966 0.1024 244.3736 16.2135 128.1077 122.8778 18.8392 6.9467 0.5410 0.2936 8.0029 5.9216 0.1799 8.3798 2.6542 12.7822 9.9799 3.7212 7.0146 5.4507 9.2763 18.3430 33.2442 14.7817 0.2561 30.3832 0.4764 18.7733 1.8197 4.0143 5.1167 9.5380 5.2426 87.8787 250.3158 1.0140 28.7158 6.2442 9.1360 0.2431 0.1524 30.7274 17.4405 74.0023 9.7033 21.4766 9.2358 29.2812 22.1033
temp: 298.150 k
press: 1.00000 atm
elementType: 8 8 8 8 6 6 6 6 6 6 6 6 6 6 6 6 6 6 6 6 6 6 1 1 1 1 1 1 1 1 1 1 1 1 1 1
symmnumber: 1
zpe: 708964.9 jmol-1
zpe.correction: 0.270030 hartree
zpe.thermalcorrener: 0.289918 hartree
zpe.thermalcorrenthalpy: 0.290862 hartree
zpe.thermalcorrgfe: 0.216732 hartree
zpe.sumelectzpe: -993.657751 hartree
zpe.sumelectthermal: -993.637864 hartree
zpe.sumelectthermalent: -993.636920 hartree
zpe.sumelectthermalfe: -993.711050 hartree
dipole: -0.0041 -0.0013 2.3136
dipole: 2.3136
quadrupole: -98.7199 -110.4317 -138.1007
quadrupole: 1.9852 0.0165 0.0006
quadrupole: 17.0309 5.3191 -22.3499 1.9852 0.0165 0.0006
hfenergy: -993.9277818 hartree
pointgroup: C01 [X(C18H14O4)]
dipole: 0.002454 -0.0275897 0.9098078 debye
polarizability: 484.1305691|30.9100755|197.5175014|0.62888|2.4703655|117.0779011 unknown
InChI: InChI=1S/C18H14O4/c19-17(20)15(11-13-7-3-1-4-8-13)16(18(21)22)12-14-9-5-2-6-10-14/h1-12,19,21H
charge 0 multiplicity 1
36 atoms
O  -0.937093 2.125515 1.520817
O  0.942626 -2.212324 1.385185
O  -1.07043 2.494233 -0.766281
O  1.061209 -2.44039 -0.920939
C  -0.708178 0.208113 0.075876
C  0.706171 -0.209848 0.061742
C  -3.199824 -0.471069 -0.058964
C  3.197515 0.477432 -0.035914
C  -1.747278 -0.685565 -0.072577
C  1.744885 0.691539 -0.032809
C  -3.849147 0.675429 0.488722
C  3.848516 -0.700558 0.438006
C  -4.019357 -1.499377 -0.615241
C  4.01536 1.538745 -0.529127
C  -5.252215 0.795123 0.450477
C  5.251567 -0.816782 0.389437
C  -5.421889 -1.376359 -0.657535
C  5.417856 1.419411 -0.58198
C  -0.937479 1.694437 0.184806
C  0.935142 -1.7001 0.078078
C  -6.047063 -0.223263 -0.12765
C  6.044699 0.236014 -0.126015
H  -1.459697 -1.729013 -0.265241
H  1.456511 1.744872 -0.159149
H  -3.265202 1.455737 0.983681
H  3.265886 -1.510206 0.885027
H  -3.540324 -2.394648 -1.030856
H  3.53506 2.457744 -0.887546
H  -5.730996 1.681309 0.881766
H  5.731718 -1.727654 0.76406
H  -6.026493 -2.175911 -1.099264
H  6.021156 2.245153 -0.974569
H  -7.137652 -0.123561 -0.155137
H  7.135278 0.138877 -0.161907
H  -1.035619 3.1183 1.544434
H  1.04018 -3.204758 1.346991
