program: Gaussian 09
title: 000287377
version: EM64L-G09RevD.01
frameworkgroup: C1[X(C15H15N3O)]
method: RPBEPBE
basis: SDD
operation: Freq
keyword: #p
keyword: freq=noraman
keyword: PBEPBE/SDD
title: #p freq=noraman PBEPBE/SDD
converged: YES YES NO NO
title: Mulliken charges:
elementType: O N N N C C C C C C C C C C C C C C C H H H H H H H H H H H H H H H
charge: -0.439300 -0.070688 -0.431230 -0.707413 0.304842 0.346494 0.195225 -0.011104 -0.089003 -0.593100 -0.371519 -0.373512 -0.310199 0.524893 -0.390513 -0.253011 -0.455523 -0.262220 -0.304975 0.206743 0.223701 0.201949 0.289588 0.254418 0.280458 0.206732 0.229098 0.219456 0.229682 0.218180 0.173465 0.306339 0.303242 0.348806
chargesum: 0.00000
title: Mulliken charges with hydrogens summed into heavy atoms:
elementType: O N N N C C C C C C C C C C C C C C C
charge: -0.090494 -0.070688 -0.141641 -0.097832 0.304842 0.346494 0.195225 -0.011104 -0.089003 -0.386357 -0.147819 -0.171563 -0.055781 0.524893 0.096677 -0.023913 -0.236067 -0.032538 0.086670
polarizability: 2.96869736e+02 -3.10944096e+01 2.43778928e+02 1.50857577e+01 6.48185602e+00 8.89240529e+01
1716.lowfreq: -6.3552 -3.8916 -0.0002 0.0003 0.0005 5.9803 20.1232 44.7443 63.8025
frequency: 20.0082 44.7074 63.7982 85.0998 116.8544 121.8930 174.4608 196.2846 212.5289 248.8537 256.8104 300.1321 332.1748 361.3097 368.1963 389.7556 397.9586 403.2518 419.6734 435.0723 450.3170 472.2759 499.7154 515.3598 548.0128 587.2560 618.4578 626.9755 648.9128 655.1199 713.3317 736.5068 747.7062 770.3528 782.5730 828.5981 850.8522 859.5060 867.2000 876.9803 882.5808 899.3531 947.1644 961.0445 986.0960 1001.9461 1005.9965 1041.7438 1047.9402 1055.0285 1090.4108 1112.6275 1138.7537 1146.0093 1182.0906 1188.2246 1207.8119 1227.9555 1254.8112 1277.3906 1298.0197 1305.2172 1312.4352 1336.2701 1355.3149 1379.5477 1384.4557 1390.0259 1434.5209 1445.9733 1457.2233 1470.8089 1475.4766 1490.6467 1512.2522 1531.7102 1560.8455 1583.8264 1616.7746 1636.2897 1645.9361 2919.6023 2955.6937 3067.0373 3091.8516 3121.7553 3123.0455 3125.8609 3135.5899 3152.3228 3163.0706 3167.1481 3504.3289 3545.4817 3569.3499 3709.8093
redmass: 5.3941 5.4872 4.5909 4.0036 3.1773 3.7284 3.5443 4.2751 4.4304 4.1420 2.7228 3.4170 1.1587 1.1170 2.5727 2.8413 5.5053 3.9101 2.1241 2.6192 3.2111 2.9095 2.8363 3.1289 1.5255 5.4373 3.1373 6.3796 4.7079 4.1865 6.0768 2.7351 6.4797 1.6133 2.2760 1.6594 2.6653 1.7443 2.0403 2.3151 3.4775 4.1299 1.3967 1.3623 1.3389 2.5608 2.9729 2.9088 1.7389 2.4299 1.9798 2.1640 1.4425 1.7183 1.1377 1.4045 1.2345 1.8888 1.6197 1.8275 1.5808 2.4537 1.4790 2.4127 1.7758 1.3725 2.8947 5.7376 3.1446 2.8344 2.7241 1.1626 1.2724 2.2904 2.3680 4.4718 6.6342 8.0786 5.8999 1.9103 2.0245 1.0713 1.0708 1.0915 1.0916 1.0891 1.0855 1.0897 1.0882 1.0934 1.0955 1.0998 1.0651 1.0755 1.0449 1.1040
irintensity: 2.6531 1.1781 3.0433 1.5710 12.1466 2.2272 3.8907 0.9769 2.3486 2.0931 0.1459 10.7335 225.6985 89.5974 1.1100 8.1869 9.9912 2.9040 36.2486 23.1494 2.9249 29.0563 89.3210 1.7121 145.7773 6.6784 26.0419 3.9180 9.8118 20.0176 0.7268 14.5764 2.8587 64.3461 0.4242 51.3999 19.8865 26.5099 0.2803 5.0625 4.3877 11.6775 1.2199 0.1184 0.0243 9.6249 38.9595 24.9489 2.4628 15.6527 20.4110 39.8532 45.7127 12.5928 13.5121 22.2712 93.7502 20.7592 15.7342 1.8459 137.4697 6.4993 27.5064 20.4380 20.7544 46.1012 6.2059 7.7541 88.0721 15.6073 23.2013 11.4687 47.6218 21.3256 353.2335 37.0853 52.3855 80.0089 13.7101 2.7947 362.8470 87.1781 103.1878 44.4995 10.8048 17.1800 2.7966 33.3891 3.6165 33.9204 17.8844 28.4667 18.3816 21.1854 102.7063 19.5927
temp: 298.150 k
press: 1.00000 atm
elementType: 8 7 7 7 6 6 6 6 6 6 6 6 6 6 6 6 6 6 6 1 1 1 1 1 1 1 1 1 1 1 1 1 1 1
symmnumber: 1
zpe: 713185.7 jmol-1
zpe.correction: 0.271638 hartree
zpe.thermalcorrener: 0.288233 hartree
zpe.thermalcorrenthalpy: 0.289177 hartree
zpe.thermalcorrgfe: 0.226846 hartree
zpe.sumelectzpe: -818.752960 hartree
zpe.sumelectthermal: -818.736365 hartree
zpe.sumelectthermalent: -818.735421 hartree
zpe.sumelectthermalfe: -818.797752 hartree
dipole: 3.4048 2.5025 -1.8052
dipole: 4.5950
quadrupole: -86.5813 -99.4230 -120.6060
quadrupole: -9.9916 15.0787 4.5641
quadrupole: 15.6221 2.7804 -18.4026 -9.9916 15.0787 4.5641
hfenergy: -819.0245979 hartree
pointgroup: C01 [X(C15H15N3O1)]
dipole: 1.271585 1.0428925 -0.7507254 debye
polarizability: 300.7267324|-24.9799536|239.234146|22.0078781|-3.4417729|89.611839 unknown
InChI: InChI=1S/C15H15N3O/c16-10-5-6-14-13(9-10)11-3-1-2-4-12(11)15(18-14)17-7-8-19/h1-6,9,17,19H,7-8,16H2
charge 0 multiplicity 1
34 atoms
O  -4.471056 -1.743791 1.483195
N  -0.491093 -1.350365 -0.224759
N  -2.684198 -0.556982 -0.492645
N  5.083187 -0.734441 0.473191
C  0.565921 1.325287 -0.093257
C  1.469351 0.176176 0.018753
C  -0.848555 1.090269 -0.243941
C  -1.312524 -0.303459 -0.326158
C  0.874153 -1.134048 -0.035063
C  2.876478 0.291976 0.186374
C  1.023927 2.676373 -0.040828
C  -1.739944 2.203428 -0.299575
C  1.7155 -2.279013 0.088699
C  3.699937 -0.850581 0.306644
C  -3.219349 -1.92167 -0.653952
C  0.134296 3.756048 -0.120349
C  3.095188 -2.150418 0.256408
C  -1.262328 3.520209 -0.243301
C  -4.582868 -2.029778 0.05197
H  3.347411 1.280758 0.229997
H  2.093334 2.880506 0.06818
H  -2.822685 2.046692 -0.364562
H  -3.251105 0.198778 -0.880242
H  1.237846 -3.262617 0.045327
H  -2.485121 -2.604971 -0.198563
H  -3.318827 -2.200964 -1.725028
H  0.513527 4.782914 -0.077966
H  3.725738 -3.043227 0.350125
H  -1.961275 4.362406 -0.285407
H  -4.969354 -3.060094 -0.02784
H  -5.320927 -1.345067 -0.426379
H  5.6656 -1.56106 0.563663
H  5.530663 0.176015 0.515644
H  -3.82255 -0.99539 1.574546
