program: Gaussian 09
title: 000287385
version: EM64L-G09RevD.01
frameworkgroup: C1[X(C17H17N3O3)]
method: RPBEPBE
basis: SDD
operation: Freq
keyword: #p
keyword: freq=noraman
keyword: PBEPBE/SDD
title: #p freq=noraman PBEPBE/SDD
converged: NO YES NO NO
title: Mulliken charges:
elementType: O O O N N N C C C C C C C C C C C C C C C C C H H H H H H H H H H H H H H H H H
charge: -0.440069 -0.217149 -0.224435 -0.432054 -0.059314 0.014999 -0.016570 -0.417120 -0.024541 0.208821 0.322749 0.339649 -0.382588 -0.083219 -0.678987 -0.359378 -0.363982 -0.527684 -0.293224 0.377268 -0.262209 -0.246703 -0.408415 0.238162 0.218628 0.214982 0.312452 0.240851 0.215798 0.201307 0.221253 0.225375 0.198814 0.239037 0.275449 0.266260 0.237437 0.239470 0.288464 0.340420
chargesum: 0.00000
title: Mulliken charges with hydrogens summed into heavy atoms:
elementType: O O O N N N C C C C C C C C C C C C C C C C C
charge: -0.099650 -0.217149 -0.224435 -0.119602 -0.059314 0.014999 0.221591 0.016490 -0.024541 0.208821 0.322749 0.339649 0.074060 -0.083219 -0.031052 -0.160564 -0.124945 -0.252235 -0.026963 0.377268 -0.024771 -0.007233 -0.119951
polarizability: 3.84970738e+02 -2.96721500e+01 2.70017739e+02 6.74915119e-01 -7.30962872e+00 1.09637988e+02
1716.lowfreq: -8.7166 -0.0007 -0.0007 0.0005 3.5883 6.0536 18.6012 35.7470 49.6795
frequency: 17.7327 35.7218 49.6626 60.4203 71.2772 76.6727 91.8387 98.8619 135.2840 142.1516 167.9040 188.1403 201.2168 245.7618 249.0737 259.8160 276.6122 294.4290 314.2099 351.5725 380.2929 396.0875 423.9898 432.3235 448.3347 468.3240 477.4520 512.5384 517.3108 568.3307 571.7892 608.2156 623.4854 655.1787 677.2795 680.9738 693.0386 716.2331 742.7898 751.6958 775.0594 778.4344 793.9964 826.4955 851.1798 858.2024 872.3513 890.0384 905.6410 932.3076 951.2593 954.0071 987.5761 996.1255 997.1853 1014.5983 1019.0780 1047.4990 1060.3427 1079.8725 1100.4276 1109.3535 1126.0527 1140.5646 1164.9652 1187.9242 1193.6665 1209.7987 1233.1478 1235.3467 1263.6944 1275.3225 1288.6267 1310.6382 1317.7312 1325.3213 1341.4251 1351.1173 1358.2136 1370.2671 1392.1752 1393.3784 1400.0086 1429.8718 1442.3826 1449.3438 1466.9343 1469.6329 1474.5849 1477.9567 1484.6866 1509.5057 1527.8969 1562.7857 1584.1166 1615.4418 1621.6162 2977.3134 2984.4377 2999.1685 3010.8970 3038.4264 3070.1626 3079.9618 3083.9124 3124.0110 3141.9569 3157.8637 3164.9386 3171.6984 3178.8154 3189.4297 3559.5937 3581.3073
redmass: 4.8764 5.0387 5.7840 8.0461 4.5120 4.3551 3.9601 1.7572 4.2678 6.3801 6.7716 2.0652 1.7198 4.1057 2.0818 1.9481 3.7380 3.5145 5.6173 5.7063 2.4344 3.3106 2.9887 4.7779 3.5688 6.7142 1.4812 3.1914 6.9880 4.2930 5.0344 6.6092 6.6391 4.0376 4.0545 6.5722 5.4339 6.4365 2.8654 7.6267 1.6816 1.4447 2.5648 2.4800 5.7675 1.5460 1.8438 2.2164 5.1608 1.5657 2.1370 1.4013 1.5815 1.3448 1.3320 4.1648 2.7772 2.1940 2.2754 2.9822 2.4434 1.6090 1.5265 1.6895 2.6462 1.1299 1.3693 7.2270 1.4654 1.7127 1.6995 1.3136 1.8580 2.5368 1.6809 1.3045 1.3791 1.9453 7.6286 1.2592 6.2659 3.5281 1.2108 3.1663 3.2697 3.3562 1.1071 1.2743 1.7418 1.2271 1.0692 2.5161 3.8593 6.8802 8.0531 6.5739 6.4630 1.0365 1.0634 1.0646 1.0797 1.0989 1.0998 1.0996 1.1038 1.0868 1.0881 1.0939 1.0891 1.0993 1.0912 1.0968 1.0658 1.0765
irintensity: 0.8445 0.5878 0.0735 0.0062 2.6892 1.6095 2.4243 0.0860 1.7647 1.3248 8.3980 4.1478 8.6636 1.5632 66.7453 95.2145 21.1335 11.7203 8.1728 0.7437 4.0111 4.7234 11.5110 0.8392 1.3284 3.3321 13.6675 0.6699 6.0406 5.2247 7.8000 3.6762 4.1818 2.1208 22.0253 8.3302 44.7927 4.0794 12.7371 7.5564 46.4380 12.8982 0.9356 4.2341 15.4012 31.5250 11.7423 28.2833 4.0444 18.5923 15.5262 4.5129 73.2031 0.0795 0.5719 2.5649 35.0561 17.8493 9.9977 31.9801 5.0863 10.6930 14.1957 1.1247 14.2448 12.8721 24.5089 905.3381 4.8989 5.2853 23.6742 1.0712 7.6040 35.0155 18.3108 13.2017 11.6343 1.1950 102.2685 41.5307 45.3928 3.6453 16.0603 79.4828 67.5236 60.5355 13.0949 57.2268 33.4126 19.2164 17.4080 84.0679 566.4508 20.8795 182.3905 78.7105 11.4830 28.6333 24.5610 21.4998 12.0844 4.8580 61.3785 48.3678 53.9829 11.1568 5.3471 19.2232 3.7088 17.3588 2.2811 2.0526 3.7813 78.3587
temp: 298.150 k
press: 1.00000 atm
elementType: 8 8 8 7 7 7 6 6 6 6 6 6 6 6 6 6 6 6 6 6 6 6 6 1 1 1 1 1 1 1 1 1 1 1 1 1 1 1 1 1
symmnumber: 1
zpe: 819352.8 jmol-1
zpe.correction: 0.312075 hartree
zpe.thermalcorrener: 0.332800 hartree
zpe.thermalcorrenthalpy: 0.333744 hartree
zpe.thermalcorrgfe: 0.261025 hartree
zpe.sumelectzpe: -1046.235537 hartree
zpe.sumelectthermal: -1046.214812 hartree
zpe.sumelectthermalent: -1046.213868 hartree
zpe.sumelectthermalfe: -1046.286588 hartree
dipole: -7.2390 3.5972 1.0589
dipole: 8.1526
quadrupole: -172.9923 -117.9720 -140.3773
quadrupole: 1.0001 -9.5597 -5.0834
quadrupole: -29.2118 25.8086 3.4032 1.0001 -9.5597 -5.0834
hfenergy: -1046.5476124 hartree
pointgroup: C01 [X(C17H17N3O3)]
dipole: -2.912119 1.1155842 0.7502568 debye
polarizability: 387.8443372|-21.1782809|262.6525264|-11.238377|26.6119812|114.1296007 unknown
InChI: InChI=1S/C17H17N3O3/c1-2-11(10-21)18-17-14-6-4-3-5-13(14)15-9-12(20(22)23)7-8-16(15)19-17/h3-9,11,18,21H,2,10H2,1H3
charge 0 multiplicity 1
40 atoms
O  -4.271633 -1.143997 -2.418761
O  5.647819 -1.697569 -0.405016
O  5.493453 0.549668 -0.032722
N  -2.851403 -0.267277 0.023092
N  -0.691845 -1.102402 -0.172753
N  4.960211 -0.617793 -0.212308
C  -3.454216 -1.616353 -0.096514
C  -4.864677 -1.616247 0.534456
C  -1.491166 -0.036402 0.023516
C  -0.978083 1.332813 0.230345
C  0.446945 1.523343 0.231865
C  1.315723 0.359932 0.026019
C  -3.48452 -2.062347 -1.581508
C  0.683634 -0.924577 -0.171108
C  -4.882769 -1.290258 2.043616
C  -1.833938 2.456836 0.422618
C  0.958221 2.839551 0.433281
C  2.729321 0.43545 0.008661
C  1.495965 -2.084354 -0.378575
C  3.49117 -0.725694 -0.198418
C  -1.307669 3.741705 0.617595
C  0.100595 3.931215 0.623733
C  2.887694 -1.999309 -0.394679
H  -2.795642 -2.324294 0.443777
H  -5.513751 -0.917815 -0.031539
H  -5.295615 -2.622864 0.374805
H  -3.48345 0.503332 0.234244
H  -2.448094 -2.161174 -1.956685
H  -3.997077 -3.035506 -1.664699
H  -4.49269 -0.277815 2.260375
H  -4.263337 -2.008513 2.612143
H  -5.911871 -1.340343 2.442463
H  -2.924195 2.343665 0.41875
H  2.038843 3.008489 0.439685
H  3.266143 1.376283 0.152523
H  0.981022 -3.038086 -0.523636
H  -1.978111 4.594913 0.763226
H  0.516558 4.93262 0.775912
H  3.523834 -2.873677 -0.552204
H  -3.762196 -0.298352 -2.503277
